{"text_format":"1","workbook":"xlsx","n_sheets":25,"sheets":["CF","AER only","Contents","Instructions","Business & other details","2.11 Labour","3.6 Quality of services","3.6.8 Network-feeders","3.6.9 Network-reliability","4.1 Public lighting","6.2 STPIS Reliability","6.6 STPIS Customer Service","6.7 STPIS Daily Performance","6.8 STPIS Exclusions","6.9 STPIS - GSL","7.8 Avoided TUOS Payments","7.10 Juris Scheme","7.11 DMIS-DMIA","7.12 Safety and Bushfire","8.1 Income","8.2 Capex","8.4 Opex","9.5 TUoS","NSP Amendments","Sheet1"],"not_rendered":{"charts":0,"images":8,"macros":1,"external_links":1,"defined_names":740,"comments":2,"pivot_tables":0},"unopened":[],"bounds":{"document_bytes":16777216,"sheet_cells":100000,"rows_first":2000,"rows_last":500,"rows_between":2000,"halvings":0,"cell_chars":16384,"cell_head_chars":4096},"cells_cut":0,"cells_raw":0,"read":"whole","date_system":"1900"}

{"sheet":"CF","index":0,"n_rows":25,"n_cols":24,"rows_kept":25,"cut":false,"hidden":true,"merged":[[1,1,1,23]]}
[]
[null,"CONDITIONAL FORMATTING MAP"]
[null,null,null,null,null,"=INDEX(dms_CF_3.6.5, MATCH(dms_TradingName,dms_CF_TradingName))=\"Y\"","=INDEX(dms_CF_3.6.6.1, MATCH(dms_TradingName,dms_CF_TradingName))=\"Y\"","=INDEX(dms_CF_3.6.6.2, MATCH(dms_TradingName,dms_CF_TradingName))=\"Y\"","=INDEX(dms_CF_3.6.6.3, MATCH(dms_TradingName,dms_CF_TradingName))=\"Y\"","=INDEX(dms_CF_3.6.7.1, MATCH(dms_TradingName,dms_CF_TradingName))=\"Y\"","=INDEX(dms_CF_3.6.7.2, MATCH(dms_TradingName,dms_CF_TradingName))=\"Y\"","=INDEX(dms_CF_3.6.7.3, MATCH(dms_TradingName,dms_CF_TradingName))=\"Y\"","=INDEX(dms_CF_3.6.7.4, MATCH(dms_TradingName,dms_CF_TradingName))=\"Y\"","=INDEX(dms_CF_6.6.1, MATCH(dms_TradingName,dms_CF_TradingName))=\"Y\"","=INDEX(dms_CF_6.6.2, MATCH(dms_TradingName,dms_CF_TradingName))=\"Y\"","=INDEX(dms_CF_6.6.3, MATCH(dms_TradingName,dms_CF_TradingName))=\"Y\"","=INDEX(dms_CF_6.6.4, MATCH(dms_TradingName,dms_CF_TradingName))=\"Y\"","=INDEX(dms_CF_6.8, MATCH(dms_TradingName,dms_CF_TradingName))=\"Y\"","=INDEX(dms_CF_7.12, MATCH(dms_TradingName,dms_CF_TradingName))=\"Y\"","=INDEX(dms_CF_8.1_A, MATCH(dms_TradingName,dms_CF_TradingName))=\"Y\"","=INDEX(dms_CF_8.1_B, MATCH(dms_TradingName,dms_CF_TradingName))=\"Y\"","=INDEX(dms_CF_8.1_Neg, MATCH(dms_TradingName,dms_CF_TradingName))=\"Y\""]
[null,"dms_CF_TradingName","JurisdictionList","Sector","Segment","dms_CF_3.6.5","dms_CF_3.6.6.1","dms_CF_3.6.6.2","dms_CF_3.6.6.3","dms_CF_3.6.7.1","dms_CF_3.6.7.2","dms_CF_3.6.7.3","dms_CF_3.6.7.4","dms_CF_6.6.1","dms_CF_6.6.2","dms_CF_6.6.3","dms_CF_6.6.4","dms_CF_6.8","dms_CF_7.12","dms_CF_8.1_A","dms_CF_8.1_B","dms_CF_8.1_Neg","Column1","Column3"]
[null,"ActewAGL Distribution","ACT","Electricity","Distribution","Y","N","Y","Y","Y","Y","N","Y","N","Y","Y","Y","Y","Y","N","Y","Y","N"]
[null,"Ausgrid","NSW","Electricity","Distribution","Y","N","Y","Y","N","N","N","Y","N","Y","Y","Y","Y","Y","N","Y","Y","N"]
[null,"AusNet (D)","Vic","Electricity","Distribution","N","N","N","N","N","N","N","N","N","Y","Y","Y","Y","N","N","N","Y","N"]
[null,"AusNet (T)","Vic","Electricity","Transmission","N","N","N","N","N","N","N","N","N","N","N","N","Y","N","N","N","Y","N"]
[null,"CitiPower","Vic","Electricity","Distribution","N","N","N","N","N","N","N","N","N","Y","Y","Y","Y","N","N","N","Y","N"]
[null,"Directlink","Qld","Electricity","Transmission","N","N","N","N","N","N","N","N","N","N","N","N","Y","N","N","Y","Y","N"]
[null,"ElectraNet","SA","Electricity","Transmission","N","N","N","N","N","N","N","N","N","N","N","N","Y","N","N","Y","Y","N"]
[null,"Endeavour Energy","NSW","Electricity","Distribution","Y","N","Y","Y","N","N","N","Y","N","Y","Y","Y","Y","Y","N","Y","Y","N"]
[null,"Energex","Qld","Electricity","Distribution","Y","N","N","N","N","N","N","N","N","Y","Y","Y","Y","Y","N","Y","Y","N"]
[null,"Ergon Energy","Qld","Electricity","Distribution","Y","N","Y","Y","N","N","N","N","N","Y","Y","Y","Y","Y","N","Y","Y","N"]
[null,"Essential Energy","NSW","Electricity","Distribution","Y","N","Y","Y","N","N","N","Y","N","Y","Y","Y","Y","Y","N","Y","Y","N"]
[null,"Jemena Electricity","Vic","Electricity","Distribution","N","N","N","N","N","N","N","N","N","Y","Y","Y","Y","N","N","N","Y","N"]
[null,"Murraylink","SA","Electricity","Transmission","N","N","N","N","N","N","N","N","N","N","N","N","Y","N","N","Y","Y","N"]
[null,"Power and Water","NT","Electricity","Distribution","N","N","N","N","N","Y","N","N","Y","Y","Y","Y","Y","Y","N","Y","Y","N"]
[null,"Powercor Australia","Vic","Electricity","Distribution","N","N","N","N","N","N","N","N","N","Y","Y","Y","Y","N","N","N","Y","N"]
[null,"Powerlink","Qld","Electricity","Transmission","N","N","N","N","N","N","N","N","N","N","N","N","Y","N","N","Y","Y","N"]
[null,"SA Power Networks","SA","Electricity","Distribution","Y","N","N","N","N","N","N","N","N","Y","Y","Y","Y","Y","Y","Y","N","N"]
[null,"TasNetworks (D)","Tas","Electricity","Distribution","Y","N","N","N","N","N","N","N","N","Y","Y","Y","Y","Y","N","Y","Y","N"]
[null,"TasNetworks (T)","Tas","Electricity","Transmission","N","N","N","N","N","N","N","N","N","N","N","N","Y","N","N","Y","Y","N"]
[null,"TransGrid","NSW","Electricity","Transmission","N","N","N","N","N","N","N","N","N","N","N","N","Y","N","N","Y","Y","N"]
[null,"United Energy","Vic","Electricity","Distribution","N","N","N","N","N","N","N","N","N","Y","Y","Y","Y","N","N","N","Y","N"]

{"sheet":"AER only","index":1,"n_rows":223,"n_cols":40,"rows_kept":223,"cut":false,"hidden":true,"merged":[[0,1,0,11],[4,27,4,38],[6,27,6,30],[6,33,6,37],[53,25,53,29],[53,30,53,33],[54,14,54,21],[54,25,54,29],[54,30,54,33],[72,14,72,15],[72,25,72,28],[93,1,95,1],[96,1,100,1],[104,1,105,1],[148,1,148,8],[54,1,54,5]]}
[null,"Data in these columns used for data validation and database purposes."]
[null,"Date last modified:","2017-01-16","added (Albury and Victora) for AGN"]
[null,null,"2016-10-17","updated TransGrid's correct legal name, corrected TasNetworks (T) to June financial year"]
[null,null,"2017-02-01","inserted Power and Water, added NRs (dms_FeederCat_1 and dms_FeederCat_2)"]
[null,null,"2017-03-03","inserted AEMO as a business",null,null,null,null,null,null,null,null,null,null,null,null,null,null,null,null,null,null,null,null,null,null,null,"FOR ELECTRICITY BUSINESSES ONLY"]
[null,null,"2018-03-28","major changes to accommodate STPIS"]
[null,null,"Template Version",5,null,null,null,null,null,null,null,null,null,null,null,null,null,null,null,null,null,null,null,null,null,null,null,"Feeder Types",null,null,null,"TasNetworks (D)","MAIFI flag","Feeder Names"]
[]
[null,null,null,null,null,null,null,null,null,null,null,null,null,null,null,null,null,null,null,null,null,null,null,null,null,null,null,"CBD","Urban","Short rural","long rural","EXTRA"]
[null,"dms_TradingName_List","dms_TradingNameFull_List","dms_ABN_List","dms_JurisdictionList","dms_Sector_List","dms_Segment_List","dms_FormControl_List","dms_RPT_List","dms_RPTMonth_List","dms_CRCPlength_List","dms_FRCPlength_List","dms_663_List","dms_DeterminationRef_List","dms_Addr1_List","dms_Addr2_List","dms_Suburb_List","dms_State_List","dms_PostCode_List","dms_PAddr1_List","dms_PAddr2_List","dms_PSuburb_List","dms_PState_List","dms_PPostCode_List","dms_ContactName1_List","dms_ContactPh1_List","dms_ContactEmail_List","dms_CBD_flag","dms_Urban_flag","dms_ShortRural_flag","dms_LongRural_flag","dms_FeederType_5_flag","dms_MAIFI_flag_List","dms_FeederName_1","dms_FeederName_2","dms_FeederName_3","dms_FeederName_4","dms_FeederName_5","dms_Public_Lighting_List","Column1"]
[null,"ActewAGL Distribution","ActewAGL Distribution",76670568688,"ACT","Electricity","Distribution","Revenue cap","Financial","June",5,5,5,"2014-19 Distribution Determination","40 Bunda Street",null,"CANBERRA","ACT",2600,"GPO BOX 366",null,"CANBERRA","ACT",2601,"Robert Walker","02 6248 3847","robert.walker@actewagle.com.au","NO","YES","YES","NO","NO","NO","CBD","Urban","Short rural","Long rural","  ","YES","ActewAGL Distribution"]
[null,"ActewAGL Distribution (Tx Assets)","ActewAGL Distribution (Tx Assets)",76670568688,"ACT","Electricity","Distribution","Revenue cap","Financial","June",5,5,5,"distribution determination","40 Bunda Street",null,"CANBERRA","ACT",2600,"GPO BOX 366",null,"CANBERRA","ACT",2601,"Robert Walker","02 6248 3847","robert.walker@actewagle.com.au","NO","YES","YES","NO","NO","NO","CBD","Urban","Short rural","Long rural","  ","NO","ActewAGL Distribution (Tx Assets)"]
[null,"ActewAGL Gas","ActewAGL Gas",76670568688,"ACT","Gas","Distribution","Weighted average price cap","Financial","June",5,5,"x",null,"40 Bunda Street",null,"CANBERRA","ACT",2600,"GPO BOX 366",null,"CANBERRA","ACT",2601,"Philip Deamer","02 6248 3438","GasAAReview@actewagl.com.au","NO","NO","NO","NO","NO",null,"CBD","Urban","Short rural","Long rural","  ","NO","ActewAGL Gas"]
[null,"AEMO","Australian Energy Market Operator Ltd",94072010327,"Vic","Electricity","Transmission","-","Financial","March",5,5,"x","-","Level 22","530 Collins Street","MELBOURNE","VIC",3000,"GPO Box 2008",null,"MELBOURNE","VIC",3001,null,null,null,"NO","NO","NO","NO","NO",null,"CBD","Urban","Short rural","Long rural","  ","NO","AEMO"]
[null,"AGN (Albury and Victoria)","Australian Gas Networks Limited (reporting data for Albury and Victoria)",19078551685,"Vic","Gas","Distribution","Weighted average price cap","Calendar","December",5,5,"x",null,"Level 6","400 King William Street","ADELAIDE","SA",5000,"PO Box 6468","Halifax Street","ADELAIDE","SA",5000,"Craig de Laine","08 8418 1129 ","craig.delaine@agn.com.au","NO","NO","NO","NO","NO",null,"CBD","Urban","Short rural","Long rural","  ","NO","AGN (Albury)"]
[null,"AGN (Albury)","Australian Gas Networks Limited (reporting data for Albury)",19078551685,"Vic","Gas","Distribution","Weighted average price cap","Calendar","December",5,5,"x",null,"Level 6","400 King William Street","ADELAIDE","SA",5000,"PO Box 6468","Halifax Street","ADELAIDE","SA",5000,"Craig de Laine","08 8418 1129 ","craig.delaine@agn.com.au","NO","NO","NO","NO","NO",null,"CBD","Urban","Short rural","Long rural","  ","NO"]
[null,"AGN (SA)","Australian Gas Networks Limited (reporting data for SA)",19078551685,"SA","Gas","Distribution","Weighted average price cap","Financial","June",5,5,5,"distribution determination","Level 6","400 King William Street","ADELAIDE","SA",5000,"PO Box 6468","Halifax Street","ADELAIDE","SA",5000,"Craig de Laine","08 8418 1129 ","craig.delaine@agn.com.au","NO","NO","NO","NO","NO",null,"CBD","Urban","Short rural","Long rural","  ","NO","AGN (SA)"]
[null,"AGN (Victoria)","Australian Gas Networks Limited (reporting data for Victoria)",19078551685,"Vic","Gas","Distribution","Weighted average price cap","Calendar","December",5,5,"x",null,"Level 6","400 King William Street","ADELAIDE","SA",5000,"PO Box 6468","Halifax Street","ADELAIDE","SA",5000,"Craig de Laine","08 8418 1129 ","craig.delaine@agn.com.au","NO","NO","NO","NO","NO",null,"CBD","Urban","Short rural","Long rural","  ","NO","AGN (Victoria)"]
[null,"Amadeus","APT Pipelines (NT) Pty Ltd",39009737393,"NT","Gas","Transmission","Weighted average price cap","Financial","June",5,5,"x","n/a","Level 19, HSBC Building","580 George Street","SYDNEY","NSW",2000,"Level 19, HSBC Building","580 George Street","SYDNEY","NSW",2000,"Alexandra Curran","02 9275 0020","alexandra.curran@apa.com.au","NO","NO","NO","NO","NO",null,"CBD","Urban","Short rural","Long rural","  ","NO","Amadeus"]
[null,"APA GasNet","APA GasNet Australia (Operations) Pty Ltd","065083009","Vic","Gas","Transmission","Weighted average price cap","Calendar","December",5,5,"x",null,"Level 19, HSBC Building","580 George Street","SYDNEY","NSW",2000,"PO Box R41",null,"ROYAL EXCHANGE","NSW",1225,"Alexandra Curran","02 9275 0020","alexandra.curran@apa.com.au","NO","NO","NO","NO","NO",null,"CBD","Urban","Short rural","Long rural","  ","NO","APA GasNet"]
[null,"Ausgrid","Ausgrid",78508211731,"NSW","Electricity","Distribution","Revenue cap","Financial","June",5,5,5,"2014-19 Distribution Determination","570 George St",null,"SYDNEY","NSW",2000,"GPO Box 4009",null,"SYDNEY","NSW",2001,"John Thomson","02 9269 2312","john.thomson@ausgrid.com.au","YES","YES","YES","YES","NO","NO","CBD","Urban","Short rural","Long rural","  ","YES","Ausgrid"]
[null,"Ausgrid (Tx Assets)","Ausgrid (Tx Assets)",67505337385,"NSW","Electricity","Distribution","Revenue cap","Financial","June",5,5,5,"distribution determination","570 George St",null,"SYDNEY","NSW",2000,"GPO Box 4009",null,"SYDNEY","NSW",2001,"John Thomson","02 9269 2312","john.thomson@ausgrid.com.au","YES","YES","YES","YES","NO","NO","CBD","Urban","Short rural","Long rural","  ","NO","Ausgrid (Tx Assets)"]
[null,"AusNet (D)","AusNet Electricity Services Pty Ltd",91064651118,"Vic","Electricity","Distribution","Revenue cap","Calendar","December",5,5,2,"2016-20 Distribution Determination","Level 32","2 Southbank Boulevard","SOUTHBANK","Vic",3006,"Locked Bag 14051",null,"MELBOURNE CITY MAIL CENTRE","VIC",8001,"please provide contact details",null,null,"NO","YES","YES","YES","NO",null,"CBD","Urban","Short rural","Long rural","  ","YES","AusNet (D)"]
[null,"AusNet (Gas)","AusNet Gas Services","086015036","Vic","Gas","Distribution","Weighted average price cap","Calendar","December",5,5,"X",null,"Level 19, HSBC Building","580 George Street","SYDNEY","NSW",2000,"PO Box R41",null,"ROYAL EXCHANGE","NSW",1225,"Alexandra Curran","02 9275 0020","alexandra.curran@apa.com.au","NO","NO","NO","NO","NO",null,"CBD","Urban","Short rural","Long rural","  ","NO","AusNet (Gas)"]
[null,"AusNet (T)","Ausnet Services (Transmission) Ltd",48116124362,"Vic","Electricity","Transmission","Revenue cap","Financial","March",5,5,2,"transmission determination","Level 32","2 Southbank Boulevard","SOUTHBANK","Vic",3006,"Locked Bag 14051",null,"MELBOURNE CITY MAIL CENTRE","Vic",8001,"Clare Thompson","03 9695 6670","clare.e.thompson@ausnetservices.com.au","NO","NO","NO","NO","NO",null,"CBD","Urban","Short rural","Long rural","  ","NO","AusNet (T)"]
[null,"Australian Distribution Co.","Australian Distribution Co.",11222333444,"-","Electricity","Distribution","Revenue cap","Financial","June",5,5,2,"distribution determination","123 Straight Street",null,"SYDNEY","NSW",2000,"PO Box 123",null,"SYDNEY","NSW",2000,"Bob Smith","02 1234 5678","bob@auselec.net.au","YES","YES","YES","YES","NO",null,"CBD","Urban","Short rural","Long rural","  ","YES","Australian Distribution Co."]
[null,"Australian Distribution Co. (Vic)","Australian Distribution Co. (Victoria)",11222333444,"Vic","Electricity","Distribution","Revenue cap","Calendar","December",5,5,2,"distribution determination","123 Straight Street",null,"MELBOURNE","Vic",3000,"PO Box 123",null,"MELBOURNE","VIC",3000,"Bob Smith","02 1234 5678","bob@auselec.net.au","NO","NO","NO","NO","NO",null,"CBD","Urban","Short rural","Long rural","  ","YES","Australian Distribution Co. (Vic)"]
[null,"Australian Distribution Co. (Gas)","Australian Gas Distribution Co. ",11222333444,"NSW","Gas","Distribution","Weighted average price cap","Financial","June",5,5,null,null,"123 Straight Street",null,"SYDNEY","NSW",2000,"PO Box 123",null,"SYDNEY","NSW",2000,"Bob Smith","02 1234 5678","bob@auselec.net.au","NO","NO","NO","NO","NO",null,"CBD","Urban","Short rural","Long rural","  ","NO","Australian Distribution Co. (Vic)"]
[null,"Australian Transmission Co.","Australian Transmission Co.",11222333444,"-","Electricity","Transmission","Revenue cap","Financial","June",5,5,5,"transmission determination","123 Straight Street",null,"SYDNEY","NSW",2000,"PO Box 123",null,"SYDNEY","NSW",2000,"Bob Smith","02 1234 5678","bob@auselec.net.au","NO","NO","NO","NO","NO",null,"CBD","Urban","Short rural","Long rural","  ","NO","Australian Transmission Co."]
[null,"Central Ranges Pipeline (D)","Central Ranges Pipeline Pty Ltd",108218355,"NSW","Gas","Distribution","Weighted average price cap","Financial","June",15,5,5,"distribution determination","Level 19","580 George Street","SYDNEY","NSW",2000,"PO Box R41",null,"ROYAL EXCHANGE","NSW",1225,"Scott Young","02 9275 0031","scott.young@apa.com.au","NO","NO","NO","NO","NO",null,"CBD","Urban","Short rural","Long rural","  ","NO"]
[null,"Central Ranges Pipeline (T)","Central Ranges Pipeline Pty Ltd",108218355,"NSW","Gas","Distribution","Weighted average price cap","Financial","June",14,5,5,"transmission determination","Level 19","580 George Street","SYDNEY","NSW",2000,"PO Box R41",null,"ROYAL EXCHANGE","NSW",1225,"Scott Young","02 9275 0031","scott.young@apa.com.au","NO","NO","NO","NO","NO",null,"CBD","Urban","Short rural","Long rural","  ","NO"]
[null,"CitiPower","CitiPower",76064651056,"Vic","Electricity","Distribution","Revenue cap","Calendar","December",5,5,2,"2016-20 Distribution Determination","40 Market Street",null,"MELBOURNE","Vic",3000,"Locked Bag 14090",null,"MELBOURNE","VIC",8001,"Hannah Williams","03 9683 4088","hwilliams@powercor.com.au","YES","YES","NO","NO","NO",null,"CBD","Urban","Short rural","Long rural","  ","YES","CitiPower"]
[null,"Directlink","Directlink",16779340889,"Qld","Electricity","Transmission","Revenue cap","Financial","June",9,5,5,"transmission determination","Level 19, HSBC Building","580 George Street","SYDNEY","NSW",2000,"PO Box R41",null,"ROYAL EXCHANGE","NSW",1225,"Scott Young","02 9275 0031","scott.young@apa.com.au","NO","NO","NO","NO","NO",null,"CBD","Urban","Short rural","Long rural","  ","NO","Directlink"]
[null,"ElectraNet","ElectraNet",41094482416,"SA","Electricity","Transmission","Revenue cap","Financial","June",5,5,5,"transmission determination","52-55 East Terrace","Rymill Park","ADELAIDE","SA",5000,"PO Box 7096","Hutt Street Post Office","ADELAIDE","SA",5000,"Bill Jackson","08 8404 7969","jackson.bill@electranet.com.au","NO","NO","NO","NO","NO",null,"CBD","Urban","Short rural","Long rural","  ","NO","ElectraNet"]
[null,"Endeavour Energy","Endeavour Energy",11247365823,"NSW","Electricity","Distribution","Revenue cap","Financial","June",5,5,5,"2014-19 Distribution Determination","51 Huntingwood Drive",null,"HUNTINGWOOD","NSW",2148,"PO Box 811",null,"SEVEN HILLS","NSW",1730,"Jon Hocking","02 9853 4386 / 0407 348 156","Jon.Hocking@Endeavourenergy.com.au","NO","YES","YES","YES","NO","NO","CBD","Urban","Short rural","Long rural","  ","YES","Endeavour Energy"]
[null,"Energex","Energex",40078849055,"Qld","Electricity","Distribution","Revenue cap","Financial","June",5,5,5,"2015-20 Distribution Determination","26 Reddacliff Street",null,"NEWSTEAD","Qld",4006,"26 Reddacliff Street",null,"NEWSTEAD","QLD",4006,"Jenny Doyle, Group Manager Regulatory Affairs","(07) 3851 6416","jenny.doyle@ergon.com.au","YES","YES","YES","NO","NO","NO","CBD","Urban","Short rural","Long rural","  ","YES","Energex"]
[null,"Ergon Energy","Ergon Energy",50087646062,"Qld","Electricity","Distribution","Revenue cap","Financial","June",5,5,5,"2015-20 Distribution Determination","22 Walker Street",null,"TOWNSVILLE","Qld",4810,"Po Box 264",null,"FORTITUDE VALLEY","QLD",4006,"Jenny Doyle, Group Manager Regulatory Affairs","(07) 3851 6416","jenny.doyle@ergon.com.au","NO","YES","YES","YES","NO","NO","CBD","Urban","Short rural","Long rural","  ","YES","Ergon Energy"]
[null,"Essential Energy","Essential Energy",37428185226,"NSW","Electricity","Distribution","Revenue cap","Financial","June",5,5,5,"2014-19 Distribution Determination","8 Buller Street",null,"PORT MACQUARIE","NSW",2444,"PO Box 5730",null,"PORT MACQUARIE","NSW",2444,"Catherine Waddell","02 6338 3553","catherine.waddell@essentialenergy.com.au","NO","NO","YES","YES","NO","NO","CBD","Urban","Short rural","Long rural","  ","YES","Essential Energy"]
[null,"Jemena Electricity","Jemena Electricity",82064651083,"Vic","Electricity","Distribution","Revenue cap","Calendar","December",5,5,2,"2016-20 Distribution Determination","Level 16","567 Collins Street","MELBOURNE","VIC",3000,"PO Box 16182",null,"MELBOURNE","VIC",8001,"Matthew Serpell","03 9173 8231","matthew.serpell@jemena.com.au","NO","YES","YES","NO","NO",null,"CBD","Urban","Short rural","Long rural","  ","YES","Jemena Electricity"]
[null,"JGN","Jemena Gas Networks (NSW) Ltd","003 004 322","NSW","Gas","Distribution","Weighted average price cap","Financial","June",5,5,null,null,null,null,null,null,null,null,null,null,null,null,"please provide contact details",null,null,"NO","NO","NO","NO","NO",null,"CBD","Urban","Short rural","Long rural","  ","NO","JGN"]
[null,"Multinet Gas","Multinet Gas (DB No.1) Pty Ltd (ACN 086 026 986), Multinet Gas (DB No.2) Pty Ltd (ACN 086 230 122)","086026986","Vic","Gas","Distribution","Weighted average price cap","Calendar","December",5,5,"x",null,"43-45 Centreway",null,"MT WAVERLEY","Vic",3149,null,null,null,null,null,"Andrew Schille","03 8846 9860","andrew.schille@ue.com.au","NO","NO","NO","NO","NO",null,"CBD","Urban","Short rural","Long rural","  ","NO","Multinet Gas"]
[null,"Murraylink","Murraylink",79181207909,"SA","Electricity","Transmission","Revenue cap","Financial","June",5,5,5,"transmission determination","Level 19","580 George Street","SYDNEY","NSW",2000,"PO Box R41",null,"ROYAL EXCHANGE","NSW",1225,"Scott Young","02 9275 0031","scott.young@apa.com.au","NO","NO","NO","NO","NO",null,"CBD","Urban","Short rural","Long rural","  ","NO","Murraylink"]
[null,"Power and Water","Power and Water Corporation",15947352360,"NT","Electricity","Distribution","Revenue cap","Financial","June",5,5,"x","distribution determination","GPO Box 1921",null,"DARWIN","NT",801,"GPO Box 1921",null,"DARWIN","NT",801,"Lucy Moon","08 8924 5822","Lucy.Moon@powerwater.com.au","YES","YES","YES","YES","NO",null,"CBD","Urban","Short rural","Long rural","  ","NO","Power and Water"]
[null,"Powercor Australia","Powercor Australia",89064651109,"Vic","Electricity","Distribution","Revenue cap","Calendar","December",5,5,2,"2016-20 Distribution Determination","40 Market Street",null,"MELBOURNE","Vic",3000,"Locked bag 14090",null,"MELBOURNE","VIC",8001,"Hannah Williams","03 9683 4088","hwilliams@powercor.com.au","NO","NO","YES","YES","NO",null,"CBD","Urban","Short rural","Long rural","  ","YES","Powercor Australia"]
[null,"Powerlink","Queensland Electricity Transmission Corporation Limited trading as Powerlink Queensland",82078849233,"Qld","Electricity","Transmission","Revenue cap","Financial","June",5,5,5,"transmission determination","33 Harold St",null,"VIRGINIA","Qld",4014,"PO Box 1193",null,"VIRGINIA","QLD",4014,"Jennifer Harris","07 3860 2667","jharris@powerlink.com.au","NO","NO","NO","NO","NO",null,"CBD","Urban","Short rural","Long rural","  ","NO","Powerlink"]
[null,"Roma to Brisbane Pipeline","APT Petroleum Pipelines Limited t/a Roma to Brisbane Pipeline","009 737 393","Qld","Gas","Transmission","Weighted average price cap","Financial","June",5,5,"x","n/a","580 George Street",null,"SYDNEY","NSW",2000,"PO Box R41",null,"ROYAL EXCHANGE","NSW",1225,"Mark Allen","02 9275 0010","mark.allen@apa.com.au","NO","NO","NO","NO","NO",null,"CBD","Urban","Short rural","Long rural","  ","NO","Roma to Brisbane Pipeline"]
[null,"SA Power Networks","SA Power Networks",13332330749,"SA","Electricity","Distribution","Revenue cap","Financial","June",5,5,5,"2015-20 Distribution Determination","1 Anzac Highway",null,"KESWICK","SA",5035,"GPO Box 77",null,"ADELAIDE","SA",5000,"Richard Sibly","08 8404 5613","richard.sibly@sapowernetworks.com.au","YES","YES","YES","YES","NO","NO","CBD","Urban","Short rural","Long rural","  ","NO","SA Power Networks"]
[null,"TasNetworks (D)","TasNetworks (D)",24167357299,"Tas","Electricity","Distribution","Revenue cap","Financial","June",5,5,5,"distribution determination","1-7 Maria Street",null,"LENAH VALLEY","Tas",7008,"PO Box 606",null,"MOONAH","Tas",7009,"John Sayers","03 6271 6469","john.sayers@tasnetworks.com.au","YES","YES","YES","YES","YES","NO","Critical Infrastructure","High density commercial","Urban","High density rural","Low density rural","YES","TasNetworks (D)"]
[null,"TasNetworks (T)","TasNetworks (T)",24167357299,"Tas","Electricity","Transmission","Revenue cap","Financial","June",5,5,5,"transmission determination","1-7 Maria Street",null,"LENAH VALLEY","Tas",7008,"PO Box 606",null,"MOONAH","Tas",7009,"John Sayers","03 6271 6469","john.sayers@tasnetworks.com.au","NO","NO","NO","NO","NO",null,"CBD","Urban","Short rural","Long rural","  ","NO","TasNetworks (T)"]
[null,"TransGrid","NSW Electricity Networks Operations Pty Ltd trading as TransGrid","70 250 995 390","NSW","Electricity","Transmission","Revenue cap","Financial","June",4,5,5,"transmission determination","180 Thomas Street",null,"SYDNEY","NSW",2000,"PO Box A1000",null,"SYDNEY SOUTH","NSW",1235,"Garrie Chubb","0408 210 221","garrie.chubb@transgrid.com.au","NO","NO","NO","NO","NO",null,"CBD","Urban","Short rural","Long rural","  ","NO","TransGrid"]
[null,"United Energy","United Energy",70064651029,"Vic","Electricity","Distribution","Revenue cap","Calendar","December",5,5,2,"2016-20 Distribution Determination","Level 3","6 Nexus Court","MULGRAVE","Vic",3149,"PO Box 449",null,"MOUNT WAVERLEY","VIC",3170,"Mathew Abraham","03 8846 9758","mathew.abraham@ue.com.au","NO","NO","YES","NO","NO",null,"CBD","Urban","Short rural","Long rural","  ","YES","United Energy"]
[]
[]
[null,null,null,null,null,null,null,null,null,null,null,null,null,null,null,null,null,null,null,null,null,null,null,null,null,"For EB & Reset RINs only",null,null,null,null,"For AARs only"]
[null,"The Reg Year Ending (dms_RYE) must be set to the last year of the regulatory period. For forecast data is is usually (FRCP_y5) for actual it is a single year (CRY). For historical actual data the RYE will need to be set manually in the business details sheet by setting the dms_Multiyear_flag to 1 and putting the correct value in 'dms_Specified_FinalYear. See cells C67:C68",null,null,null,null,null,null,null,null,null,null,null,"Drop down selector box for CA & Reset RINs.","For CA & Reset RINs only",null,null,null,null,null,null,null,null,null,null,"for DNSP only",null,null,null,null,"For DNSPs only"]
[null,"dms_Model_List ","dms_Worksheet_List",null,"dms_RYE_Formula_Result",null,null,null,null,null,null,null,null,"dms_0203_ProjectType","dms_020303_01_UOM","dms_020501_01_UOM","dms_020501_02_UOM","dms_020501_03_UOM","dms_020501_04_UOM","dms_020603_01_UOM","dms_020701_01_UOM","dms_020701_02_UOM","dms_020701_01_Rows","dms_040102_01_UOM","dms_040102_04_UOM","dms_030601_01_UOM","dms_030601_02_UOM","dms_030701_01_UOM","dms_030702_01_UOM","dms_030703_01_UOM","dms_030605_UOM","dms_03060703_UOM"]
[null,"ARR","ANNUAL REPORTING STATEMENT",null,{"$f":"LEFT(dms_SingleYear_FinalYear_Result,2)&RIGHT(dms_SingleYear_FinalYear_Result,2)","v":"2018"},"=LEFT(dms_SingleYear_FinalYear_Result,2)&RIGHT(dms_SingleYear_FinalYear_Result,2)",null,"Formula errors are OK",null,null,null,null,null,"New line on new route - single circuit","Circuit line length in km","0's","0's","0's","0's","0's","km","km","Route line length within zone","0's","days","minutes/customer","minutes/customer","Customer / km","%","km","number","number"]
[null,"CA","CATEGORY ANALYSIS",null,{"$f":"LEFT(dms_SingleYear_FinalYear_Result,2)&RIGHT(dms_SingleYear_FinalYear_Result,2)","v":"2018"},"=LEFT(dms_SingleYear_FinalYear_Result,2)&RIGHT(dms_SingleYear_FinalYear_Result,2)",null,"Formula errors are OK",null,null,null,null,null,"New line on new route - dual circuit","Circuit line length in km","0's","0's","0's","0's","0's","0's","0's","Number of maintenance spans","0's","0's","minutes/customer","minutes/customer","MWh/customer","Number of spans",null,"number","number"]
[null,"CESS","CAPITLAL EXPENDITURE SHARING SCHEMING",null,"2016","=LEFT(dms_SingleYear_FinalYear_Result,2)&RIGHT(dms_SingleYear_FinalYear_Result,2)",null,null,null,null,null,null,null,"New line on new route - other","Circuit line length in km","MVA added","MVA added","MVA added","MVA added","0's","km","km","Total length of maintenance spans","0's","$0s","interruptions/customer","interruptions/customer","kVA / customer","Number of spans",null,"number","number"]
[null,"CPI","CPI",null,null,null,null,null,null,null,null,null,null,"Line rebuild over existing route - single circuit","Circuit line length in km","0's","0's","0's","0's","0's","km","km","Length of vegetation corridors","$0s","0's","interruptions/customer","interruptions/customer",null,"Number of spans",null,"number","number"]
[null,"EB","ECONOMIC BENCHMARKING",null,{"$f":"LEFT(dms_SingleYear_FinalYear_Result,2)&RIGHT(dms_SingleYear_FinalYear_Result,2)","v":"2018"},"=LEFT(dms_SingleYear_FinalYear_Result,2)&RIGHT(dms_SingleYear_FinalYear_Result,2)",null,"Formula errors are OK",null,null,null,null,null,"Line rebuild over existing route - dual circuit","Number","total spend $0s","total spend $0s","total spend $0s","total spend $0s","(per cent)","0's","0's","Average number of trees per maintenance span",null,null,null,null,null,"Number of spans",null,"number","(per cent)"]
[null,"PTRM","POST TAX REVENUE MODEL",null,{"$f":"LEFT(dms_MultiYear_FinalYear_Result,2)&RIGHT(dms_MultiYear_FinalYear_Result,2)","v":"2025"},"=LEFT(dms_MultiYear_FinalYear_Result,2)&RIGHT(dms_MultiYear_FinalYear_Result,2)",null,null,null,null,null,null,null,"Reconductor - Single circuit","Number","net circuit km added","net circuit km added","net circuit km added","net circuit km added",null,"years","years","Average frequency of cutting cycle",null,null,null,null,null,"Years",null,"number"]
[null,"Reset","REGULATORY REPORTING STATEMENT",null,{"$f":"LEFT(dms_MultiYear_FinalYear_Result,2)&RIGHT(dms_MultiYear_FinalYear_Result,2)","v":"2025"},"=LEFT(dms_MultiYear_FinalYear_Result,2)&RIGHT(dms_MultiYear_FinalYear_Result,2)",null,"Formula errors are OK",null,null,null,null,null,"Reconductor - Dual circuit","Number","total spend $0s","total spend $0s","total spend $0s","total spend $0s",null,null,null,null,null,null,null,null,null,"Years",null,"number"]
[null,"RFM","ROLL FORWARD MODEL",null,{"$f":"LEFT(dms_CRCP_FinalYear_Result,2)&RIGHT(dms_CRCP_FinalYear_Result,2)","v":"2018"},"=LEFT(dms_CRCP_FinalYear_Result,2)&RIGHT(dms_CRCP_FinalYear_Result,2)",null,null,null,null,null,null,null,"Other",null,"net circuit km added","net circuit km added","net circuit km added","net circuit km added",null,null,null,null,null,null,null,null,null,"Trees",null,"number"]
[null,"WACC","WEIGHTED AVERAGE COST OF CAPITAL",null,{"$f":"LEFT(dms_MultiYear_FinalYear_Result,2)&RIGHT(dms_MultiYear_FinalYear_Result,2)","v":"2025"},"=LEFT(dms_MultiYear_FinalYear_Result,2)&RIGHT(dms_MultiYear_FinalYear_Result,2)",null,null,null,null,null,null,null,null,null,"total spend $0s","total spend $0s","total spend $0s","total spend $0s",null,null,null,null,null,null,null,null,null,"Trees",null,"number"]
[null,null,null,null,null,null,null,null,null,null,null,null,null,null,null,"0's",null,"$0s",null,null,null,null,null,null,null,null,null,null,"Defects",null,"number"]
[null,"dms_DataQuality_List",null,null,null,null,null,null,null,null,null,null,null,null,null,"0's",null,null,null,null,null,null,null,null,null,null,null,null,"Defects",null,"number"]
[null,"Actual",null,null,null,null,null,null,null,null,null,null,null,null,null,"0's",null,null,null,null,null,null,null,null,null,null,null,null,"Spans",null,"number"]
[null,"Estimate",null,null,null,null,null,null,null,null,null,null,null,null,null,"$0s",null,null,null,null,null,null,null,null,null,null,null,null,"km",null,"(per cent)"]
[null,"Consolidated",null,null,null,null,null,null,null,null,null,null,null,null,null,null,null,null,null,null,null,null,null,null,null,null,null,null,"Spans",null,"(per cent)",""]
[null,"Recast"]
[null,"Public"]
[null,null,null,null,null,null,null,null,null,null,null,null,null,null,"For PTRM files - this field set the text for the named range \"DMS_Xfactor\" which in all cases is simply the text \"x factors\" - this saves putting in each old gas PTRM file ",null,null,null,null,null,null,null,null,null,null,"for TNSP only"]
[null,"For all files either AER or business needs to be able to specify the type of submission","For PTRM & RFM templates we must provide a choice in case they change their form of control - otherwise it is drawn from the business specific lookup table above.",null,null,null,null,null,null,null,null,null,null,null,"DMS_Xfactor",null,null,null,null,null,null,null,null,null,null,"dms_030601_01_UOM",null,"dms_030701_01_UOM","dms_030702_01_UOM"]
[null,"dms_SourceList","dms_FormControl_Choices",null,null,null,null,null,null,null,null,null,null,null,"x factors",null,null,null,null,null,null,null,null,null,null,"%",null,"Number of spans","km"]
[null,"After appeal","Revenue cap",null,null,null,null,null,null,null,null,null,null,null,null,null,null,null,null,null,null,null,null,null,null,"number",null,"Years","%"]
[null,"Draft decision","Revenue yield",null,null,null,null,null,null,null,null,null,null,null,null,null,null,null,null,null,null,null,null,null,null,"number",null,"Trees","km"]
[null,"Final decision","Weighted average price cap",null,null,null,null,null,null,null,null,null,null,null,null,null,null,null,null,null,null,null,null,null,null,"%",null,"Defects","number"]
[null,"PTRM update 1",null,null,null,null,null,null,null,null,null,null,null,null,null,null,null,null,null,null,null,null,null,null,null,"number",null,"Number of spans"]
[null,"PTRM update 2",null,null,null,null,null,null,null,null,null,null,null,null,null,null,null,null,null,null,null,null,null,null,null,"number",null,"km"]
[null,"PTRM update 3",null,null,null,null,null,null,null,null,null,null,null,null,null,null,null,null,null,null,null,null,null,null,null,"%",null,"km"]
[null,"PTRM update 4",null,null,null,null,null,null,null,null,null,null,null,null,null,null,null,null,null,null,null,null,null,null,null,"number",null,"Number of spans"]
[null,"PTRM update 5",null,null,null,null,null,null,null,null,null,null,null,null,null,null,null,null,null,null,null,null,null,null,null,"number"]
[null,"PTRM update 6",null,null,null,null,null,null,null,null,null,null,null,null,null,null,null,null,null,null,null,null,null,null,null,"%"]
[null,"PTRM update 7",null,null,null,null,null,null,null,null,null,null,null,null,null,null,null,null,null,null,null,null,null,null,null,"number"]
[null,"Regulatory proposal",null,null,null,null,null,null,null,null,null,null,null,null,null,null,null,null,null,null,null,null,null,null,null,"%"]
[null,"Reporting",null,null,null,null,null,null,null,null,null,null,null,null,null,null,null,null,null,null,null,null,null,null,null,"number"]
[null,"Revised regulatory proposal",null,null,null,null,null,null,null,null,null,null,null,null,null,null,null,null,null,null,null,null,null,null,null,"%"]
[null,null,null,null,null,null,null,null,null,null,null,null,null,null,null,null,null,null,null,null,null,null,null,null,null,"number"]
[]
[]
[]
[null,"Reason for interruption","dms_Reason_Interruption_Detailed","dms_Reason_Interruption","dms_STPIS_Exclusion_List","dms_020301_ProjectType_List","dms_020302_ProjectType_List"]
[null,"Animal","Animal impact","Animal","Weather","New substation establishment","New line on new route - single circuit"]
[null,null,"Animal nesting/burrowing, etc and other","Asset failure","Equipment failure","Capacity upgrade","New line on new route - dual circuit"]
[null,null,"Other","Other","Operational error","Voltage upgrade","New line on new route - other"]
[null,"Asset failure","LV","Overloads","Vegetation","Other","Line rebuild over existing route - single circuit"]
[null,null,"Distribution substation","Planned","Animals",null,"Line rebuild over existing route - dual circuit"]
[null,null,"HV","Network business","Third party impacts",null,"Reconductor - Single circuit"]
[null,null,"Zone substation","Third party","Transmission failure",null,"Reconductor - Dual circuit"]
[null,null,"Subtransmission","Unknown","Load shedding",null,"Reconductor - Other"]
[null,"Other","insert description of 'other'","Vegetation","Inter-distributor connection failure",null,"Line upgrade - raising/retensoring"]
[null,"Overloads","-","Weather","Other",null,"Line upgrade - voltage upgrade"]
[null,"Planned","-","2 - STPIS Exclusion (3.3)(a)",null,null,"Line upgrade - capacity"]
[null,"Network business","Network error","3 - STPIS Exclusion (3.3)(a)",null,null,"String spare circuit"]
[null,null,"Switching and protection error","4 - STPIS Exclusion (3.3)(a)",null,null,"Other"]
[null,"Third party","Fire","5 - STPIS Exclusion (3.3)(a)"]
[null,null,"Other","6 - STPIS Exclusion (3.3)(a)"]
[null,null,"Dig-in","7 - STPIS Exclusion (3.3)(a)"]
[null,null,"Unauthorised access"]
[null,null,"Vehicle impact"]
[null,"Unknown","Unknown"]
[null,"Vegetation","Blow-in/Fall-in - NSP responsibility"]
[null,null,"Grow-in - NSP responsibility"]
[null,null,"Blow-in/Fall-in - Other responsible party"]
[null,null,"Grow-in - Other responsible party"]
[null,"Weather"]
[null,"2 - STPIS Exclusion (3.3)(a)"]
[null,"3 - STPIS Exclusion (3.3)(a)"]
[null,"4 - STPIS Exclusion (3.3)(a)"]
[null,"5 - STPIS Exclusion (3.3)(a)"]
[null,"6 - STPIS Exclusion (3.3)(a)"]
[null,"7 - STPIS Exclusion (3.3)(a)"]
[]
[]
[]
[]
[]
[]
[]
[null,"These are indeces and lookup values for various dates. All step from the value placed in FRCP_y1 on the business and other details worksheet",{"$f":"IF(dms_FifthFeeder_flag_NSP=\"NO\",\"This NSP has only 4 feeder categories\",\"This NSP has 5 feeder categories\")","v":"This NSP has only 4 feeder categories"},null,null,null,null,null,null,null,null,null,null,null,"These date tables are currently used in the Recast templates to provide column headings and conditional formatting"]
[null,"dms_FRCPlength_Num_List","dms_FinalYear_List","dms_CRCPlength_Num_List","dms_CFinalYear_List","dms_FRCP_years",null,"dms_CRCP_years",null,"dms_CRCP_index",null,"dms_Financial_Years","dms_Calendar_Years",null,"CRY from input cell on business sheet","CRY - financial","dms_FinYears","CRY calendar","dms_CalYears"]
[null,1,"dms_FRCP_y1",1,"CRCP_y1",{"$f":"FRCP_y1","v":"2020-21"},"dms_FRCP_y1",{"$f":"IF(dms_RPT=\"financial\",VALUE(LEFT(dms_FRCP_y1,4)-1)&\"-\"&TEXT(VALUE(MID(dms_FRCP_y1,3,2)),\"00\"),VALUE(LEFT(dms_FRCP_y1,4)-1))","v":"2019-20"},"dms_CRCP_yZ",1,null,"2005-06","2006",null,{"$f":"CRY","v":"2017-18"},{"$f":"VALUE(LEFT(CRY,4))&\"-\"&TEXT(MID(CRY,3,2)+1,\"00\")","v":"2017-18"},"dms_CRYf_y1",{"$f":"VALUE(LEFT(CRY,4)+1)","v":2018},"dms_CRYc_y1"]
[null,2,"dms_FRCP_y2",2,"CRCP_y2",{"$f":"IF(dms_RPT=\"financial\",VALUE(LEFT(dms_FRCP_y1,4)+1)&\"-\"&TEXT(VALUE(RIGHT(dms_FRCP_y1,2)+1),\"00\"),VALUE(LEFT(dms_FRCP_y1,4)+1))","v":"2021-22"},"dms_FRCP_y2",{"$f":"IF(dms_RPT=\"financial\",VALUE(LEFT(dms_CRCP_yZ,4)-1)&\"-\"&TEXT(VALUE(MID(dms_CRCP_yZ,3,2)),\"00\"),VALUE(LEFT(dms_CRCP_yZ,4)-1))","v":"2018-19"},"dms_CRCP_yY",2,null,"2006-07","2007",null,null,{"$f":"VALUE(LEFT(dms_CRYf_y1,4)+1)&\"-\"&TEXT(MID(dms_CRYf_y1,3,2)+2,\"00\")","v":"2018-19"},"dms_CRYf_y2",{"$f":"VALUE(LEFT(dms_CRYc_y1,4)+1)","v":2019},"dms_CRYc_y2"]
[null,3,"dms_FRCP_y3",3,"CRCP_y3",{"$f":"IF(dms_RPT=\"financial\",VALUE(LEFT(dms_FRCP_y2,4)+1)&\"-\"&TEXT(VALUE(RIGHT(dms_FRCP_y2,2)+1),\"00\"),VALUE(LEFT(dms_FRCP_y2,4)+1))","v":"2022-23"},"dms_FRCP_y3",{"$f":"IF(dms_RPT=\"financial\",VALUE(LEFT(dms_CRCP_yY,4)-1)&\"-\"&TEXT(VALUE(MID(dms_CRCP_yY,3,2)),\"00\"),VALUE(LEFT(dms_CRCP_yY,4)-1))","v":"2017-18"},"dms_CRCP_yX",3,null,"2007-08","2008",null,null,{"$f":"VALUE(LEFT(dms_CRYf_y2,4)+1)&\"-\"&TEXT(MID(dms_CRYf_y2,3,2)+2,\"00\")","v":"2019-20"},"dms_CRYf_y3",{"$f":"VALUE(LEFT(dms_CRYc_y2,4)+1)","v":2020},"dms_CRYc_y3"]
[null,4,"dms_FRCP_y4",4,"CRCP_y4",{"$f":"IF(dms_RPT=\"financial\",VALUE(LEFT(dms_FRCP_y3,4)+1)&\"-\"&TEXT(VALUE(RIGHT(dms_FRCP_y3,2)+1),\"00\"),VALUE(LEFT(dms_FRCP_y3,4)+1))","v":"2023-24"},"dms_FRCP_y4",{"$f":"IF(dms_RPT=\"financial\",VALUE(LEFT(dms_CRCP_yX,4)-1)&\"-\"&TEXT(VALUE(MID(dms_CRCP_yX,3,2)),\"00\"),VALUE(LEFT(dms_CRCP_yX,4)-1))","v":"2016-17"},"dms_CRCP_yW",4,null,"2008-09","2009",null,null,{"$f":"VALUE(LEFT(dms_CRYf_y3,4)+1)&\"-\"&TEXT(MID(dms_CRYf_y3,3,2)+2,\"00\")","v":"2020-21"},"dms_CRYf_y4",{"$f":"VALUE(LEFT(dms_CRYc_y3,4)+1)","v":2021},"dms_CRYc_y4"]
[null,5,"dms_FRCP_y5",5,"CRCP_y5",{"$f":"IF(dms_RPT=\"financial\",VALUE(LEFT(dms_FRCP_y4,4)+1)&\"-\"&TEXT(VALUE(RIGHT(dms_FRCP_y4,2)+1),\"00\"),VALUE(LEFT(dms_FRCP_y4,4)+1))","v":"2024-25"},"dms_FRCP_y5",{"$f":"IF(dms_RPT=\"financial\",VALUE(LEFT(dms_CRCP_yW,4)-1)&\"-\"&TEXT(VALUE(MID(dms_CRCP_yW,3,2)),\"00\"),VALUE(LEFT(dms_CRCP_yW,4)-1))","v":"2015-16"},"dms_CRCP_yV",5,null,"2009-10",2010,null,null,{"$f":"VALUE(LEFT(dms_CRYf_y4,4)+1)&\"-\"&TEXT(MID(dms_CRYf_y4,3,2)+2,\"00\")","v":"2021-22"},"dms_CRYf_y5",{"$f":"VALUE(LEFT(dms_CRYc_y4,4)+1)","v":2022},"dms_CRYc_y5"]
[null,6,"dms_FRCP_y6",6,"CRCP_y6",{"$f":"IF(dms_RPT=\"financial\",VALUE(LEFT(dms_FRCP_y5,4)+1)&\"-\"&TEXT(VALUE(RIGHT(dms_FRCP_y5,2)+1),\"00\"),VALUE(LEFT(dms_FRCP_y5,4)+1))","v":"2025-26"},"dms_FRCP_y6",{"$f":"IF(dms_RPT=\"financial\",VALUE(LEFT(dms_CRCP_yV,4)-1)&\"-\"&TEXT(VALUE(MID(dms_CRCP_yV,3,2)),\"00\"),VALUE(LEFT(dms_CRCP_yV,4)-1))","v":"2014-15"},"dms_CRCP_yU",6,null,"2010-11",2011,null,null,{"$f":"VALUE(LEFT(dms_CRYf_y5,4)+1)&\"-\"&TEXT(MID(dms_CRYf_y5,3,2)+2,\"00\")","v":"2022-23"},"dms_CRYf_y6",{"$f":"VALUE(LEFT(dms_CRYc_y5,4)+1)","v":2023},"dms_CRYc_y6"]
[null,7,"dms_FRCP_y7",7,"CRCP_y7",{"$f":"IF(dms_RPT=\"financial\",VALUE(LEFT(dms_FRCP_y6,4)+1)&\"-\"&TEXT(VALUE(RIGHT(dms_FRCP_y6,2)+1),\"00\"),VALUE(LEFT(dms_FRCP_y6,4)+1))","v":"2026-27"},"dms_FRCP_y7",{"$f":"IF(dms_RPT=\"financial\",VALUE(LEFT(dms_CRCP_yU,4)-1)&\"-\"&TEXT(VALUE(MID(dms_CRCP_yU,3,2)),\"00\"),VALUE(LEFT(dms_CRCP_yU,4)-1))","v":"2013-14"},"dms_CRCP_yT",7,null,"2011-12",2012,null,null,{"$f":"VALUE(LEFT(dms_CRYf_y6,4)+1)&\"-\"&TEXT(MID(dms_CRYf_y6,3,2)+2,\"00\")","v":"2023-24"},"dms_CRYf_y7",{"$f":"VALUE(LEFT(dms_CRYc_y6,4)+1)","v":2024},"dms_CRYc_y7"]
[null,8,"dms_FRCP_y8",8,"CRCP_y8",{"$f":"IF(dms_RPT=\"financial\",VALUE(LEFT(dms_FRCP_y7,4)+1)&\"-\"&TEXT(VALUE(RIGHT(dms_FRCP_y7,2)+1),\"00\"),VALUE(LEFT(dms_FRCP_y7,4)+1))","v":"2027-28"},"dms_FRCP_y8",{"$f":"IF(dms_RPT=\"financial\",VALUE(LEFT(dms_CRCP_yT,4)-1)&\"-\"&TEXT(VALUE(MID(dms_CRCP_yT,3,2)),\"00\"),VALUE(LEFT(dms_CRCP_yT,4)-1))","v":"2012-13"},"dms_CRCP_yS",8,null,"2012-13",2013,null,null,{"$f":"VALUE(LEFT(dms_CRYf_y7,4)+1)&\"-\"&TEXT(MID(dms_CRYf_y7,3,2)+2,\"00\")","v":"2024-25"},"dms_CRYf_y8",{"$f":"VALUE(LEFT(dms_CRYc_y7,4)+1)","v":2025},"dms_CRYc_y8"]
[null,9,"dms_FRCP_y9",9,"CRCP_y9",{"$f":"IF(dms_RPT=\"financial\",VALUE(LEFT(dms_FRCP_y8,4)+1)&\"-\"&TEXT(VALUE(RIGHT(dms_FRCP_y8,2)+1),\"00\"),VALUE(LEFT(dms_FRCP_y8,4)+1))","v":"2028-29"},"dms_FRCP_y9",{"$f":"IF(dms_RPT=\"financial\",VALUE(LEFT(dms_CRCP_yS,4)-1)&\"-\"&TEXT(VALUE(MID(dms_CRCP_yS,3,2)),\"00\"),VALUE(LEFT(dms_CRCP_yS,4)-1))","v":"2011-12"},"dms_CRCP_yR",9,null,"2013-14",2014,null,null,{"$f":"VALUE(LEFT(dms_CRYf_y8,4)+1)&\"-\"&TEXT(MID(dms_CRYf_y8,3,2)+2,\"00\")","v":"2025-26"},"dms_CRYf_y9",{"$f":"VALUE(LEFT(dms_CRYc_y8,4)+1)","v":2026},"dms_CRYc_y9"]
[null,10,"dms_FRCP_y10",10,"CRCP_y10",{"$f":"IF(dms_RPT=\"financial\",VALUE(LEFT(dms_FRCP_y9,4)+1)&\"-\"&TEXT(VALUE(RIGHT(dms_FRCP_y9,2)+1),\"00\"),VALUE(LEFT(dms_FRCP_y9,4)+1))","v":"2029-30"},"dms_FRCP_y10",{"$f":"IF(dms_RPT=\"financial\",VALUE(LEFT(dms_CRCP_yR,4)-1)&\"-\"&TEXT(VALUE(MID(dms_CRCP_yR,3,2)),\"00\"),VALUE(LEFT(dms_CRCP_yR,4)-1))","v":"2010-11"},"dms_CRCP_yQ",10,null,"2014-15",2015,null,null,{"$f":"VALUE(LEFT(dms_CRYf_y9,4)+1)&\"-\"&TEXT(MID(dms_CRYf_y9,3,2)+2,\"00\")","v":"2026-27"},"dms_CRYf_y10",{"$f":"VALUE(LEFT(dms_CRYc_y9,4)+1)","v":2027},"dms_CRYc_y10"]
[null,11,"dms_FRCP_y11",11,"CRCP_y11",{"$f":"IF(dms_RPT=\"financial\",VALUE(LEFT(dms_FRCP_y10,4)+1)&\"-\"&TEXT(VALUE(RIGHT(dms_FRCP_y10,2)+1),\"00\"),VALUE(LEFT(dms_FRCP_y10,4)+1))","v":"2030-31"},"dms_FRCP_y11",{"$f":"IF(dms_RPT=\"financial\",VALUE(LEFT(dms_CRCP_yQ,4)-1)&\"-\"&TEXT(VALUE(MID(dms_CRCP_yQ,3,2)),\"00\"),VALUE(LEFT(dms_CRCP_yQ,4)-1))","v":"2009-10"},"dms_CRCP_yP",11,null,"2015-16",2016,null,null,{"$f":"VALUE(LEFT(dms_CRYf_y10,4)+1)&\"-\"&TEXT(MID(dms_CRYf_y10,3,2)+2,\"00\")","v":"2027-28"},"dms_CRYf_y11",{"$f":"VALUE(LEFT(dms_CRYc_y10,4)+1)","v":2028},"dms_CRYc_y11"]
[null,12,"dms_FRCP_y12",12,"CRCP_y12",{"$f":"IF(dms_RPT=\"financial\",VALUE(LEFT(dms_FRCP_y11,4)+1)&\"-\"&TEXT(VALUE(RIGHT(dms_FRCP_y11,2)+1),\"00\"),VALUE(LEFT(dms_FRCP_y11,4)+1))","v":"2031-32"},"dms_FRCP_y12",{"$f":"IF(dms_RPT=\"financial\",VALUE(LEFT(dms_CRCP_yP,4)-1)&\"-\"&TEXT(VALUE(MID(dms_CRCP_yP,3,2)),\"00\"),VALUE(LEFT(dms_CRCP_yP,4)-1))","v":"2008-09"},"dms_CRCP_yO",12,null,"2016-17",2017,null,null,{"$f":"VALUE(LEFT(dms_CRYf_y11,4)+1)&\"-\"&TEXT(MID(dms_CRYf_y11,3,2)+2,\"00\")","v":"2028-29"},"dms_CRYf_y12",{"$f":"VALUE(LEFT(dms_CRYc_y11,4)+1)","v":2029},"dms_CRYc_y12"]
[null,13,"dms_FRCP_y13",13,"CRCP_y13",{"$f":"IF(dms_RPT=\"financial\",VALUE(LEFT(dms_FRCP_y12,4)+1)&\"-\"&TEXT(VALUE(RIGHT(dms_FRCP_y12,2)+1),\"00\"),VALUE(LEFT(dms_FRCP_y12,4)+1))","v":"2032-33"},"dms_FRCP_y13",{"$f":"IF(dms_RPT=\"financial\",VALUE(LEFT(dms_CRCP_yO,4)-1)&\"-\"&TEXT(VALUE(MID(dms_CRCP_yO,3,2)),\"00\"),VALUE(LEFT(dms_CRCP_yO,4)-1))","v":"2007-08"},"dms_CRCP_yN",13,null,"2017-18",2018,null,null,{"$f":"VALUE(LEFT(dms_CRYf_y12,4)+1)&\"-\"&TEXT(MID(dms_CRYf_y12,3,2)+2,\"00\")","v":"2029-30"},"dms_CRYf_y13",{"$f":"VALUE(LEFT(dms_CRYc_y12,4)+1)","v":2030},"dms_CRYc_y13"]
[null,14,"dms_FRCP_y14",14,"CRCP_y14",{"$f":"IF(dms_RPT=\"financial\",VALUE(LEFT(dms_FRCP_y13,4)+1)&\"-\"&TEXT(VALUE(RIGHT(dms_FRCP_y13,2)+1),\"00\"),VALUE(LEFT(dms_FRCP_y13,4)+1))","v":"2033-34"},"dms_FRCP_y14",{"$f":"IF(dms_RPT=\"financial\",VALUE(LEFT(dms_CRCP_yN,4)-1)&\"-\"&TEXT(VALUE(MID(dms_CRCP_yN,3,2)),\"00\"),VALUE(LEFT(dms_CRCP_yN,4)-1))","v":"2006-07"},"dms_CRCP_yM",14,null,"2018-19",2019,null,null,{"$f":"VALUE(LEFT(dms_CRYf_y13,4)+1)&\"-\"&TEXT(MID(dms_CRYf_y13,3,2)+2,\"00\")","v":"2030-31"},"dms_CRYf_y14",{"$f":"VALUE(LEFT(dms_CRYc_y13,4)+1)","v":2031},"dms_CRYc_y14"]
[null,15,"dms_FRCP_y15",15,"CRCP_y15",{"$f":"IF(dms_RPT=\"financial\",VALUE(LEFT(dms_FRCP_y14,4)+1)&\"-\"&TEXT(VALUE(RIGHT(dms_FRCP_y14,2)+1),\"00\"),VALUE(LEFT(dms_FRCP_y14,4)+1))","v":"2034-35"},"dms_FRCP_y15",{"$f":"IF(dms_RPT=\"financial\",VALUE(LEFT(dms_CRCP_yM,4)-1)&\"-\"&TEXT(VALUE(MID(dms_CRCP_yM,3,2)),\"00\"),VALUE(LEFT(dms_CRCP_yM,4)-1))","v":"2005-06"},"dms_CRCP_yL",15,null,"2019-20",2020,null,null,{"$f":"VALUE(LEFT(dms_CRYf_y14,4)+1)&\"-\"&TEXT(MID(dms_CRYf_y14,3,2)+2,\"00\")","v":"2031-32"},"dms_CRYf_y15",{"$f":"VALUE(LEFT(dms_CRYc_y14,4)+1)","v":2032},"dms_CRYc_y15"]
[null,null,null,null,null,null,null,null,null,null,null,"2020-21",2021,null,null,{"$f":"VALUE(LEFT(dms_CRYf_y15,4)+1)&\"-\"&TEXT(MID(dms_CRYf_y15,3,2)+2,\"00\")","v":"2032-33"},"dms_CRYf_y16",{"$f":"VALUE(LEFT(dms_CRYc_y15,4)+1)","v":2033},"dms_CRYc_y16"]
[null,"These are drop down lists for businesses to select the correct FRCP_y1 on the business and other details worksheet.\nThis also populates the column headings in the worksheets",null,null,null,null,null,null,null,null,null,"2021-22",2022,null,null,{"$f":"VALUE(LEFT(dms_CRYf_y16,4)+1)&\"-\"&TEXT(MID(dms_CRYf_y16,3,2)+2,\"00\")","v":"2033-34"},"dms_CRYf_y17",{"$f":"VALUE(LEFT(dms_CRYc_y16,4)+1)","v":2034},"dms_CRYc_y17"]
[null,"dms_RCP_fyear_list","dms_CRY_ListF","dms_CRY_ListC","dms_RCP_cyear_list","dms_FRCP_fyear_list","dms_FRCP_ListF","dms_FRCP_ListC","dms_FRCP_cyear_list",null,null,"2022-23",2023,null,null,{"$f":"VALUE(LEFT(dms_CRYf_y17,4)+1)&\"-\"&TEXT(MID(dms_CRYf_y17,3,2)+2,\"00\")","v":"2034-35"},"dms_CRYf_y18",{"$f":"VALUE(LEFT(dms_CRYc_y17,4)+1)","v":2035},"dms_CRYc_y18"]
[null,"dms_y1",{"$f":"CRY","v":"2017-18"},"2006","dms_cy1","dms_frcp_fy1","2010-11",2011,"dms_crcp_cy1",null,null,"2023-24",2024,null,null,{"$f":"VALUE(LEFT(dms_CRYf_y18,4)+1)&\"-\"&TEXT(MID(dms_CRYf_y18,3,2)+2,\"00\")","v":"2035-36"},"dms_CRYf_y19",{"$f":"VALUE(LEFT(dms_CRYc_y18,4)+1)","v":2036},"dms_CRYc_y19"]
[null,"dms_y2",{"$f":"IF(dms_RPT=\"financial\",VALUE(LEFT(CRY,4)+1)&\"-\"&TEXT(MID(CRY,3,2)+2,\"00\"),VALUE(LEFT(CRY,4)+1))","v":"2018-19"},"2007","dms_cy2","dms_frcp_fy2","2011-12",2012,"dms_crcp_cy2",null,null,"2024-25",2025,null,null,{"$f":"VALUE(LEFT(dms_CRYf_y19,4)+1)&\"-\"&TEXT(MID(dms_CRYf_y19,3,2)+2,\"00\")","v":"2036-37"},"dms_CRYf_y20",{"$f":"VALUE(LEFT(dms_CRYc_y19,4)+1)","v":2037},"dms_CRYc_y20"]
[null,"dms_y3",{"$f":"IF(dms_RPT=\"financial\",VALUE(LEFT(dms_fy2,4)+1)&\"-\"&TEXT(MID(dms_fy2,3,2)+2,\"00\"),VALUE(LEFT(dms_fy2,4)+1))","v":"2019-20"},"2008","dms_cy3","dms_frcp_fy3","2012-13",2013,"dms_crcp_cy3",null,null,"2025-26",2026]
[null,"dms_y4",{"$f":"IF(dms_RPT=\"financial\",VALUE(LEFT(dms_fy3,4)+1)&\"-\"&TEXT(MID(dms_fy3,3,2)+2,\"00\"),VALUE(LEFT(dms_fy3,4)+1))","v":"2020-21"},"2009","dms_cy4","dms_frcp_fy4","2013-14",2014,"dms_crcp_cy4",null,null,"2026-27",2027]
[null,"dms_y5",{"$f":"IF(dms_RPT=\"financial\",VALUE(LEFT(dms_fy4,4)+1)&\"-\"&TEXT(MID(dms_fy4,3,2)+2,\"00\"),VALUE(LEFT(dms_fy4,4)+1))","v":"2021-22"},2010,"dms_cy5","dms_frcp_fy5","2014-15",2015,"dms_crcp_cy5",null,null,"2027-28",2028]
[null,"dms_y6",{"$f":"IF(dms_RPT=\"financial\",VALUE(LEFT(dms_fy5,4)+1)&\"-\"&TEXT(MID(dms_fy5,3,2)+2,\"00\"),VALUE(LEFT(dms_fy5,4)+1))","v":"2022-23"},2011,"dms_cy6","dms_frcp_fy6","2015-16",2016,"dms_crcp_cy6",null,null,"2028-29",2029]
[null,"dms_y7",{"$f":"IF(dms_RPT=\"financial\",VALUE(LEFT(dms_fy6,4)+1)&\"-\"&TEXT(MID(dms_fy6,3,2)+2,\"00\"),VALUE(LEFT(dms_fy6,4)+1))","v":"2023-24"},2012,"dms_cy7","dms_frcp_fy7","2016-17",2017,"dms_crcp_cy7",null,null,"2029-30",2030]
[null,"dms_y8",{"$f":"IF(dms_RPT=\"financial\",VALUE(LEFT(dms_fy7,4)+1)&\"-\"&TEXT(MID(dms_fy7,3,2)+2,\"00\"),VALUE(LEFT(dms_fy7,4)+1))","v":"2024-25"},2013,"dms_cy8","dms_frcp_fy8","2017-18",2018,"dms_crcp_cy8",null,null,"2030-31",2031]
[null,"dms_y9",{"$f":"IF(dms_RPT=\"financial\",VALUE(LEFT(dms_fy8,4)+1)&\"-\"&TEXT(MID(dms_fy8,3,2)+2,\"00\"),VALUE(LEFT(dms_fy8,4)+1))","v":"2025-26"},2014,"dms_cy9","dms_frcp_fy9","2018-19",2019,"dms_crcp_cy9",null,null,"2031-32",2032]
[null,"dms_y10",{"$f":"IF(dms_RPT=\"financial\",VALUE(LEFT(dms_fy9,4)+1)&\"-\"&TEXT(MID(dms_fy9,3,2)+2,\"00\"),VALUE(LEFT(dms_fy9,4)+1))","v":"2026-27"},2015,"dms_cy10","dms_frcp_fy10","2019-20",2020,"dms_crcp_cy10",null,null,"2032-33",2033]
[null,"dms_y11",{"$f":"IF(dms_RPT=\"financial\",VALUE(LEFT(dms_fy10,4)+1)&\"-\"&TEXT(MID(dms_fy10,3,2)+2,\"00\"),VALUE(LEFT(dms_fy10,4)+1))","v":"2027-28"},2016,"dms_cy11","dms_frcp_fy11","2020-21",2021,"dms_crcp_cy11",null,null,"2033-34",2034]
[null,"dms_y12",{"$f":"IF(dms_RPT=\"financial\",VALUE(LEFT(dms_fy11,4)+1)&\"-\"&TEXT(MID(dms_fy11,3,2)+2,\"00\"),VALUE(LEFT(dms_fy11,4)+1))","v":"2028-29"},2017,"dms_cy12","dms_frcp_fy12","2021-22",2022,"dms_crcp_cy12",null,null,"2034-35",2035]
[null,"dms_y13",{"$f":"IF(dms_RPT=\"financial\",VALUE(LEFT(dms_fy12,4)+1)&\"-\"&TEXT(MID(dms_fy12,3,2)+2,\"00\"),VALUE(LEFT(dms_fy12,4)+1))","v":"2029-30"},2018,"dms_cy13","dms_frcp_fy13","2022-23",2023,"dms_crcp_cy13",null,null,"2035-36",2036]
[null,"dms_y14",{"$f":"IF(dms_RPT=\"financial\",VALUE(LEFT(dms_fy13,4)+1)&\"-\"&TEXT(MID(dms_fy13,3,2)+2,\"00\"),VALUE(LEFT(dms_fy13,4)+1))","v":"2030-31"},2019,"dms_cy14","dms_frcp_fy14","2023-24",2024,"dms_crcp_cy14"]
[null,"dms_y15",{"$f":"IF(dms_RPT=\"financial\",VALUE(LEFT(dms_fy14,4)+1)&\"-\"&TEXT(MID(dms_fy14,3,2)+2,\"00\"),VALUE(LEFT(dms_fy14,4)+1))","v":"2031-32"},2020,"dms_cy15","dms_frcp_fy15","2024-25",2025,"dms_crcp_cy15"]
[null,"dms_y16",{"$f":"IF(dms_RPT=\"financial\",VALUE(LEFT(dms_fy15,4)+1)&\"-\"&TEXT(MID(dms_fy15,3,2)+2,\"00\"),VALUE(LEFT(dms_fy15,4)+1))","v":"2032-33"},2021,"dms_cy16"]
[null,"dms_y17",{"$f":"IF(dms_RPT=\"financial\",VALUE(LEFT(dms_fy16,4)+1)&\"-\"&TEXT(MID(dms_fy16,3,2)+2,\"00\"),VALUE(LEFT(dms_fy16,4)+1))","v":"2033-34"},2022,"dms_cy17"]
[null,"dms_y18",{"$f":"IF(dms_RPT=\"financial\",VALUE(LEFT(dms_fy17,4)+1)&\"-\"&TEXT(MID(dms_fy17,3,2)+2,\"00\"),VALUE(LEFT(dms_fy17,4)+1))","v":"2034-35"},2023,"dms_cy18"]
[null,"dms_y19",{"$f":"IF(dms_RPT=\"financial\",VALUE(LEFT(dms_fy18,4)+1)&\"-\"&TEXT(MID(dms_fy18,3,2)+2,\"00\"),VALUE(LEFT(dms_fy18,4)+1))","v":"2035-36"},2024,"dms_cy19"]
[null,"dms_y20",{"$f":"IF(dms_RPT=\"financial\",VALUE(LEFT(dms_fy19,4)+1)&\"-\"&TEXT(MID(dms_fy19,3,2)+2,\"00\"),VALUE(LEFT(dms_fy19)+1))","v":"2036-37"},2025,"dms_cy20"]
[]
[]
[]
[]
[]
[null,"These \"row descriptions\" are the column headings in the various templates but become row descriptions in the ETL process"]
[null,null,"Table 6.3 sustained interruptions - row descriptions"]
[null,null,"dms_060301_CustNo_Affected_Row","dms_060301_Avg_Duration_Sustained_Int_Row","dms_060301_Effect_unplanned_SAIDI_Row","dms_060301_Effect_unplanned_SAIFI_Row"]
[null,null,"Number of customers affected by the interruption","Average duration of sustained customer interruption","Effect on unplanned SAIDI","Effect on unplanned SAIFI"]
[]
[]
[]
[null,null,"Table 6.1 telephone answering - row descriptions and start date"]
[null,null,"dms_060101_Rows","dms_060102_Rows","dms_060101_StartDateTxt"]
[null,null,"Total number of calls \n(after removing excluded events)","Number of calls answered within 30 seconds \n(after excluding excluded events) ",{"$f":"dms_060701_StartDateTxt","v":"1-Jul-2017"}]
[]
[]
[]
[null,null,null,null,null,null,null,"dms_0603_FeederList",{"$f":"INDEX(dms_FeederName_1,MATCH(dms_TradingName,dms_TradingName_List))","v":"CBD"},{"$f":"INDEX(dms_FeederName_2,MATCH(dms_TradingName,dms_TradingName_List))","v":"Urban"},{"$f":"INDEX(dms_FeederName_3,MATCH(dms_TradingName,dms_TradingName_List))","v":"Short rural"},{"$f":"INDEX(dms_FeederName_4,MATCH(dms_TradingName,dms_TradingName_List))","v":"Long rural"},{"$f":"INDEX(dms_FeederName_5,MATCH(dms_TradingName,dms_TradingName_List))","v":"  "}]
[null,null,"Table 6.7.1 - daily performance data - unplanned - MAIFI  -- row descriptions and header named range values"]
[null,null,"These headings (Lists) are determined from the INDEX/MATCH function on the NSP selected on the Business & other details sheet"]
[null,"dms_060701_Feeder_Header_Lvl4",{"$f":"INDEX(dms_FeederName_1,MATCH(dms_TradingName,dms_TradingName_List))","v":"CBD"},{"$f":"INDEX(dms_FeederName_1,MATCH(dms_TradingName,dms_TradingName_List))","v":"CBD"},{"$f":"INDEX(dms_FeederName_2,MATCH(dms_TradingName,dms_TradingName_List))","v":"Urban"},{"$f":"INDEX(dms_FeederName_2,MATCH(dms_TradingName,dms_TradingName_List))","v":"Urban"},{"$f":"INDEX(dms_FeederName_3,MATCH(dms_TradingName,dms_TradingName_List))","v":"Short rural"},{"$f":"INDEX(dms_FeederName_3,MATCH(dms_TradingName,dms_TradingName_List))","v":"Short rural"},{"$f":"INDEX(dms_FeederName_4,MATCH(dms_TradingName,dms_TradingName_List))","v":"Long rural"},{"$f":"INDEX(dms_FeederName_4,MATCH(dms_TradingName,dms_TradingName_List))","v":"Long rural"},{"$f":"IF((INDEX(dms_FeederName_5,MATCH(dms_TradingName,dms_TradingName_List))=0),\"Network\",(INDEX(dms_FeederName_5,MATCH(dms_TradingName,dms_TradingName_List))))","v":"  "},{"$f":"IF((INDEX(dms_FeederName_5,MATCH(dms_TradingName,dms_TradingName_List))=0),\"Network\",(INDEX(dms_FeederName_5,MATCH(dms_TradingName,dms_TradingName_List))))","v":"  "},"Network","Network"]
[]
[null,"dms_060701_Rows","All events","After removing excluded events","All events","After removing excluded events","All events","After removing excluded events","All events","After removing excluded events","All events","After removing excluded events","All events","After removing excluded events"]
[null,null,"the number of column headings changes from 10 to 12 depending on the number of feeder categories for the NSP"]
[]
[]
[]
[]
[null,null,"Table 6.8.1 - row descriptions"]
[null,null,"dms_060801_01_Rows","dms_060801_02_Rows","dms_060801_03_Rows","dms_060801_04_Rows"]
[null,null,"Number of interruptions","Duration of interruptions","Total unplanned minutes off supply","Effect on unplanned MAIFI"]
[]
[]
[]
[]
[null,null,"Table 7.9.4 - market impact component - row descriptions"]
[null,"dms_070904_01_Rows","without exclusions","with exclusions"]
[]
[]
[]
[]
[]
[null,null,"Use this to add to existing files"]
[null,null,"ARRs 6.7 STPIS daily performance"]
[null,null,"dms_060101_Values","dms_060102_Values","dms_060701_Values"]
[]
[null,null,"ARR's  6.8 STPIS exclusions"]
[null,null,"dms_060801_Event_Date","dms_060801_OutageID","dms_060801_FeederID","dms_060801_FeederClass","dms_060801_CauseID","dms_060801_01_Values","dms_060801_02_Values","dms_060801_03_Values","dms_060801_Excl_Cat","dms_060801_04_Values"]
[null,null,"dms_060801_StartCell"]
[]
[null,null,"CA 6.3 sustained interruptions"]
[null,null,"dms_060301_Event_Date","dms_060301_Event_Time","dms_060301_AssetID","dms_060301_FeederClass","dms_060301_Reason","dms_060301_DetailedReason","dms_060301_CustNo_Affected_Values","dms_060301_Avg_Duration_Sustained_Int_Values","dms_060301_Effect_unplanned_SAIDI_Values","dms_060301_Effect_unplanned_SAIFI_Values","dms_060301_MED"]

{"sheet":"Contents","index":2,"n_rows":31,"n_cols":4,"rows_kept":31,"cut":false,"hidden":false,"merged":[[2,1,2,3],[3,1,3,3],[4,1,4,3]]}
[]
[]
[null,{"$f":"CONCATENATE(dms_Segment,\" Network Service Provider\")","v":"Distribution Network Service Provider"}]
[]
[null,"Table of Contents"]
[]
[]
[null,null,"Instructions"]
[null,null,"Business & other details"]
[]
[]
[null,"CATEGORY ANALYSIS","STPIS","STATUTORY ACCOUNTS"]
[]
[null,"2.11 Labour","6.2 STPIS Reliability","8.1 Income"]
[null,null,"6.6 STPIS Customer Service","8.2 Capex"]
[null,null,"6.7 STPIS Daily Performance"]
[null,null,"6.8 STPIS Exclusions","8.4 Opex"]
[null,null,"6.9 STPIS GSL"]
[]
[]
[]
[null,"NETWORK PERFORMANCE","OTHER INFORMATION","PRICING PROPOSAL"]
[null,null,null,"Victorian Businesses Only"]
[null,"3.6 Quality of services","7.8 Avoided Cost Payments"]
[null,"3.6.8 Network-feeders","7.10 Juris Scheme","9.5 TUoS"]
[null,"3.6.9 Network-reliability","7.11 DMIS-DMIA"]
[null,null,"7.12 Safety and Bushfire"]
[]
[null,"PUBLIC LIGHTING"]
[]
[null,"4.1 Public lighting tariffs"]

{"sheet":"Instructions","index":3,"n_rows":27,"n_cols":4,"rows_kept":27,"cut":false,"hidden":false,"merged":[[7,2,7,3],[1,1,1,5],[2,1,2,5],[3,2,3,4],[4,2,4,4],[5,2,5,4],[24,2,24,4],[25,2,25,3],[26,2,26,4],[8,2,8,4],[10,2,10,4],[12,2,12,4],[20,2,20,4],[22,2,22,4]]}
[]
[null,{"$f":"CONCATENATE(dms_Segment,\" Network Service Provider\")","v":"Distribution Network Service Provider"}]
[null,{"$f":"IF(dms_Model=\"Reset\",\"Regulatory Proposal RIN Template\",\"Annual Reporting RIN\")","v":"Annual Reporting RIN"}]
[null,null,"This template is to be used by Australian Distribution Co. to fulfil its reporting obligations to the AER."]
[null,null,"INSTRUCTIONS"]
[null,null,"Complete the Business & other details worksheet before entering data or values in any other worksheets. The Business & other details worksheet is linked to other worksheets within the workbook and automatically generates certain column headings and conditional formatting."]
[]
[null,null,"Identifying CONFIDENTIAL INFORMATION:\n\nPlease use the macro at the top of each \nworksheet to identify confidential information. \n\n"]
[null,null,"-Do this by selecting the cell or cells that contain confidential information and then run the Mark selected cells as CONFIDENTIAL macro. This will format the cells a specific colour that is identified by the AER's database which in turn marks that information as confidential.\n\n-To reverse this, select the cell or cells and run the Return cells to NON-CONFIDENTIAL macro."]
[]
[null,null,"UNITS OF MEASURE\n\nAll amounts are to be unrounded and reported on a one for one basis: that is 1000 is to be entered as '1000'. Applicable units of measure may be identified in the table column headings or row descriptors.\n\n"]
[]
[null,null,"COLOUR CODING OF INPUT / NON-INPUT CELLS:"]
[null,null,null,"Yellow = Input cell (mandatory)"]
[null,null,null,"Darker yellow = input cell (mandatory)"]
[null,null,null,"Orange = input cell (if data available)"]
[null,null,null,"Grey = Not applicable/No inputs required"]
[null,null,null," \nPLEASE DO NOT ENTER TEXT into cells that are to contain numeric data."]
[]
[]
[null,null,"WORKSHEET NAVIGATION\n\nMany tables in the worksheets have been \"grouped\" to allow for easy navigation. To ungroup or group data use the outline symbols in the left margin (for Row groupings) or above the columns (for column groupings). \n\n\n\n"]
[]
[null,null,"RETURNING COMPLETED RESPONSES\n\nPlease return two (2) files to the AER: \n1. A confidential version which must contain a complete set of all responses with confidential information marked using the Mark selection CONFIDENTIAL macro and which has been completed using the locked template file provided by the AER. \n\n2. A public version with confidential information either removed completely or aggregated in some form together with writtten consent to disclose the public version of the response.\n\nUse the drop down box on the Business and other details worksheet to identify the file as either confidential ('consolidated') or public. "]
[]
[null,null,"SUBMITTING AMENDED DATA TO THE AER\n\nIf an NSP wishes to correct data previously submitted to the AER it should resubmit that data using the original completed submission as the starting point. Please make any necessary changes to the data. Data that is not being amended should be left unchanged. \n\nNSPs must identify the reason for the amendments in the Amendment Reason box on the  Business and other details worksheet. NSPs may provide further details regarding any amendments in the Amendments worksheet. \n\n."]
[null,null,"NSP may use Amended Data macro \nto highlight cells that contain amended data.\nNB: if data is also CONFIDENTIAL, re-apply \nthe Confidentiality macro after applying the \nAmended macro"]
[null,null,"Please resubmit two (2) files - a confidential version and a public version of the amended submission to the AER"]

{"sheet":"Business & other details","index":4,"n_rows":156,"n_cols":9,"rows_kept":156,"cut":false,"hidden":false,"merged":[[7,1,7,8],[11,1,11,8],[13,2,13,4],[14,2,14,4],[17,2,17,3],[17,4,17,7],[59,2,59,8],[18,4,18,7],[19,2,19,3],[19,4,19,7],[22,2,22,3],[22,4,22,7],[23,4,23,7],[24,2,24,3],[24,4,24,7],[32,1,32,8],[57,2,57,3],[58,4,58,8]]}
[null,{"$f":"IF(dms_DataQuality=\"backcast\",INDEX(dms_Worksheet_List,MATCH(dms_Model,dms_Model_List))&\" BACKCAST\",INDEX(dms_Worksheet_List,MATCH(dms_Model,dms_Model_List)))","v":"ANNUAL REPORTING STATEMENT"}]
[null,{"$f":"INDEX(dms_TradingNameFull_List,MATCH(dms_TradingName,dms_TradingName_List))","v":"Endeavour Energy"}]
[null,{"$f":"IF(SUM(dms_SingleYear_Model)>0,CONCATENATE(CRY),CONCATENATE(FRCP_y1,\" to \",dms_MultiYear_FinalYear_Result))","v":"2017-18"}]
[null,"BUSINESS & OTHER DETAILS"]
[]
[]
[null,"Instructions"]
[null,"Complete the following business details regulatory template before entering data or values in any other regulatory template. This regulatory template is linked to other cells within the spreadsheet and automatically generates column headings and conditional formatting to distinguish business specific input and non-input cells. "]
[]
[null,"SUBMISSION PARTICULARS INPUT SHEETS"]
[]
[null,"ENTITY DETAILS"]
[]
[null,"Short name","Endeavour Energy",null,null,"Select business name from drop down list first"]
[null,"ACN / ABN",{"$f":"INDEX(dms_ABN_List,MATCH(dms_TradingName,dms_TradingName_List))","v":11247365823}]
[]
[]
[null,"Business address","Address 1",null,{"$f":"INDEX(dms_Addr1_List,MATCH(dms_TradingName,dms_TradingName_List))","v":"51 Huntingwood Drive"}]
[null,null,null,"Address 2",{"$f":"IF(ISBLANK(INDEX(dms_Addr2_List,MATCH(dms_TradingName,dms_TradingName_List))),\"\",(INDEX(dms_Addr2_List,MATCH(dms_TradingName,dms_TradingName_List))))","v":""}]
[null,null,"Suburb",null,{"$f":"INDEX(dms_Suburb_List,MATCH(dms_TradingName,dms_TradingName_List))","v":"HUNTINGWOOD"}]
[null,null,null,"State",{"$f":"INDEX(dms_State_List,MATCH(dms_TradingName,dms_TradingName_List))","v":"NSW"},"p/code",{"$f":"INDEX(dms_PostCode_List,MATCH(dms_TradingName,dms_TradingName_List))","v":2148}]
[]
[null,"Postal address","Address 1",null,{"$f":"INDEX(dms_PAddr1_List,MATCH(dms_TradingName,dms_TradingName_List))","v":"PO Box 811"}]
[null,null,null,"Address 2",{"$f":"IF(ISBLANK(INDEX(dms_PAddr2_List,MATCH(dms_TradingName,dms_TradingName_List))),\"\",(INDEX(dms_PAddr2_List,MATCH(dms_TradingName,dms_TradingName_List))))","v":""}]
[null,null,"Suburb",null,{"$f":"INDEX(dms_PSuburb_List,MATCH(dms_TradingName,dms_TradingName_List))","v":"SEVEN HILLS"}]
[null,null,null,"State",{"$f":"INDEX(dms_PState_List,MATCH(dms_TradingName,dms_TradingName_List))","v":"NSW"},"p/code",{"$f":"INDEX(dms_PPostCode_List,MATCH(dms_TradingName,dms_TradingName_List))","v":1730}]
[]
[]
[null,"Contact name/s","Fiona Place"]
[null,"Contact phone/s","(02) 9853 6302"]
[null,"Contact email address/s","fiona.place@endeavourenergy.com.au"]
[]
[null,"REGULATORY CONTROL PERIODS"]
[]
[null,"Forthcoming regulatory control period","2020-21",{"$f":"dms_FRCP_y2","v":"2021-22"},{"$f":"dms_FRCP_y3","v":"2022-23"},{"$f":"dms_FRCP_y4","v":"2023-24"},{"$f":"dms_FRCP_y5","v":"2024-25"}]
[null,null,{"$f":"dms_FRCP_y6","v":"2025-26"},{"$f":"dms_FRCP_y7","v":"2026-27"},{"$f":"dms_FRCP_y8","v":"2027-28"},{"$f":"dms_FRCP_y9","v":"2028-29"},{"$f":"dms_FRCP_y10","v":"2029-30"}]
[]
[]
[null,"Current regulatory control period",{"$f":"dms_CRCP_FirstYear_Result","v":"2015-16"},{"$f":"IF(dms_RPT=\"financial\",VALUE(LEFT(CRCP_y1,4)+1)&\"-\"&TEXT(MID(CRCP_y1,3,2)+2,\"00\"),VALUE(LEFT(CRCP_y1,4)+1))","v":"2016-17"},{"$f":"IF(dms_RPT=\"financial\",VALUE(LEFT(CRCP_y1,4)+2)&\"-\"&TEXT(VALUE(MID(CRCP_y1,3,2)+3),\"00\"),VALUE(LEFT(CRCP_y1,4)+2))","v":"2017-18"},{"$f":"IF(dms_RPT=\"financial\",VALUE(LEFT(CRCP_y1,4)+3)&\"-\"&TEXT(MID(CRCP_y1,3,2)+4,\"00\"),VALUE(LEFT(CRCP_y1,4)+3))","v":"2018-19"},{"$f":"IF(dms_RPT=\"financial\",VALUE(LEFT(CRCP_y1,4)+4)&\"-\"&TEXT(MID(CRCP_y1,3,2)+5,\"00\"),VALUE(LEFT(CRCP_y1,4)+4))","v":"2019-20"}]
[null,null,{"$f":"IF(dms_RPT=\"financial\",VALUE(LEFT(CRCP_y1,4)+5)&\"-\"&TEXT(MID(CRCP_y1,3,2)+6,\"00\"),VALUE(LEFT(CRCP_y1,4)+5))","v":"2020-21"},{"$f":"IF(dms_RPT=\"financial\",VALUE(LEFT(CRCP_y1,4)+6)&\"-\"&TEXT(MID(CRCP_y1,3,2)+7,\"00\"),VALUE(LEFT(CRCP_y1,4)+6))","v":"2021-22"},{"$f":"IF(dms_RPT=\"financial\",VALUE(LEFT(CRCP_y1,4)+7)&\"-\"&TEXT(MID(CRCP_y1,3,2)+8,\"00\"),VALUE(LEFT(CRCP_y1,4)+7))","v":"2022-23"},{"$f":"IF(dms_RPT=\"financial\",VALUE(LEFT(CRCP_y1,4)+8)&\"-\"&TEXT(MID(CRCP_y1,3,2)+9,\"00\"),VALUE(LEFT(CRCP_y1,4)+8))","v":"2023-24"},{"$f":"IF(dms_RPT=\"financial\",VALUE(LEFT(CRCP_y1,4)+9)&\"-\"&TEXT(MID(CRCP_y1,3,2)+10,\"00\"),VALUE(LEFT(CRCP_y1,4)+9))","v":"2024-25"}]
[null,null,{"$f":"IF(dms_RPT=\"financial\",VALUE(LEFT(CRCP_y1,4)+10)&\"-\"&TEXT(MID(CRCP_y1,3,2)+11,\"00\"),VALUE(LEFT(CRCP_y1,4)+10))","v":"2025-26"},{"$f":"IF(dms_RPT=\"financial\",VALUE(LEFT(CRCP_y1,4)+11)&\"-\"&TEXT(MID(CRCP_y1,3,2)+12,\"00\"),VALUE(LEFT(CRCP_y1,4)+11))","v":"2026-27"},{"$f":"IF(dms_RPT=\"financial\",VALUE(LEFT(CRCP_y1,4)+12)&\"-\"&TEXT(MID(CRCP_y1,3,2)+13,\"00\"),VALUE(LEFT(CRCP_y1,4)+12))","v":"2027-28"},{"$f":"IF(dms_RPT=\"financial\",VALUE(LEFT(CRCP_y1,4)+13)&\"-\"&TEXT(MID(CRCP_y1,3,2)+14,\"00\"),VALUE(LEFT(CRCP_y1,4)+13))","v":"2028-29"},{"$f":"IF(dms_RPT=\"financial\",VALUE(LEFT(CRCP_y1,4)+14)&\"-\"&TEXT(MID(CRCP_y1,3,2)+15,\"00\"),VALUE(LEFT(CRCP_y1,4)+14))","v":"2029-30"}]
[]
[]
[null,"Previous regulatory control period",{"$f":"IF(dms_RPT=\"financial\",VALUE(LEFT(PRCP_y2,4)-1)&\"-\"&TEXT(VALUE(MID(PRCP_y2,3,2)),\"00\"),VALUE(LEFT(PRCP_y2,4)-1))","v":"2010-11"},{"$f":"IF(dms_RPT=\"financial\",VALUE(LEFT(PRCP_y3,4)-1)&\"-\"&TEXT(VALUE(MID(PRCP_y3,3,2)),\"00\"),VALUE(LEFT(PRCP_y3,4)-1))","v":"2011-12"},{"$f":"IF(dms_RPT=\"financial\",VALUE(LEFT(PRCP_y4,4)-1)&\"-\"&TEXT(VALUE(MID(PRCP_y4,3,2)),\"00\"),VALUE(LEFT(PRCP_y4,4)-1))","v":"2012-13"},{"$f":"IF(dms_RPT=\"financial\",VALUE(LEFT(PRCP_y5,4)-1)&\"-\"&TEXT(VALUE(RIGHT(PRCP_y5,2)-1),\"00\"),VALUE(LEFT(PRCP_y5,4)-1))","v":"2013-14"},{"$f":"IF(dms_RPT=\"financial\",VALUE(LEFT(CRCP_y1,4)-1)&\"-\"&TEXT(VALUE(RIGHT(CRCP_y1,2)-1),\"00\"),VALUE(LEFT(CRCP_y1,4)-1))","v":"2014-15"}]
[]
[]
[]
[null,"Commencing regulatory year","2017-18","CRY"]
[]
[null,"Last completed regulatory year","2017-18","dms_FinalYear"]
[]
[]
[]
[null,null,"IF THIS IS AN ABC RIN - make sure the the named range CRY is applied and the named range dms_dollar_nom_UOM is applied"]
[null,null,"IF THIS IS A RESET RIN - make sure the named ranges CRY and dms_dollar_nom_UOM are NOT present in the workbook"]
[null,null,"FOR ABC RINS THAT SPAN MULTIPLE YEARS - make sure MultiYear Flag is set and final year entered as required"]
[]
[null,"Source","Reporting",null,"Please select the correct submission type from the dropdown list."]
[null,"Data quality (actual, estimate, public, consolidated)","Consolidated",null,"Use Consolidated for Consolidated Confidential version\nUse Public for Consolidated Public version"]
[null,"Amended RIN submission - amendment reason","Data has been amended in table 8.1 to reflect $, rather than $'000.  Amendments have been made in table 2.11.3.2 to reconcile cells C33 and C36. "]
[null,"Submission Date","2018-11-21","dms_SubmissionDate","Please enter date this file submitted to AER (dd/mm/yyyy)"]
[null,"EBSS - First application of scheme in forthcoming period?","No"]
[null,"Sector",{"$f":"INDEX(dms_Sector_List,MATCH(dms_TradingName,dms_TradingName_List))","v":"Electricity"},"dms_Sector","=INDEX(dms_Sector_List,MATCH(dms_TradingName,dms_TradingName_List))"]
[null,"Segment",{"$f":"INDEX(dms_Segment_List,MATCH(dms_TradingName,dms_TradingName_List))","v":"Distribution"},"dms_Segment","=INDEX(dms_Segment_List,MATCH(dms_TradingName,dms_TradingName_List))"]
[null,"Regulatory Year Ending",{"$f":"IF(dms_MultiYear_Flag=1,LEFT(dms_Specified_FinalYear,2)&RIGHT(dms_Specified_FinalYear,2),INDEX(dms_RYE_Formula_Result,MATCH(dms_Model,dms_Model_List)))","v":"2018"},"dms_RYE","=IF(dms_MultiYear_Flag=1,LEFT(dms_Specified_FinalYear,2)&RIGHT(dms_Specified_FinalYear,2),INDEX(dms_RYE_Formula_Result,MATCH(dms_Model,dms_Model_List)))"]
[null,"Reporting Period Type",{"$f":"INDEX(dms_RPT_List,MATCH(dms_TradingName,dms_TradingName_List))","v":"Financial"},"dms_RPT","=INDEX(dms_RPT_List,MATCH(dms_TradingName,dms_TradingName_List))"]
[null,"Model or RIN Type","ARR","dms_Model","Drop down selection"]
[null,"EB/CA Unit of Measure for Monetary Values","$0s","dms_dollar_nom_UOM","If the cover sheet is attached to an ABC RIN apply the NAMED RANGE to the cell"]
[null,"Security Classification","Public","dms_Classification","Always Public"]
[null,"Jurisdiction",{"$f":"INDEX(dms_JurisdictionList,MATCH(dms_TradingName,dms_TradingName_List))","v":"NSW"},"dms_Jurisdiction","=INDEX(dms_JurisdictionList,MATCH(dms_TradingName,dms_TradingName_List))"]
[null,"FORECAST and MultiYear RINS"]
[null,"CRY-1  (last full calendar year before CRY)",{"$f":"IF(dms_RPT=\"financial\",VALUE(LEFT(dms_SingleYear_FinalYear_Result,4)),VALUE(LEFT(dms_SingleYear_FinalYear_Result,4)-1))","v":2017},"dms_Cal_Year_B4_CRY","'=IF(dms_RPT=\"financial\",VALUE(LEFT(dms_SingleYear_FinalYear_Result,4)),VALUE(LEFT(dms_SingleYear_FinalYear_Result,4)-1))"]
[null,"Dollar $ real month",{"$f":"INDEX(dms_RPTMonth_List,MATCH(dms_TradingName,dms_TradingName_List))","v":"June"},"dms_RPTMonth","=INDEX(dms_RPTMonth_List,MATCH(dms_TradingName,dms_TradingName_List))"]
[null,"Dollar $ real  (the last month before the FRCP_y1)",{"$f":"IF(SUM(dms_SingleYear_Model)>0,CONCATENATE(dms_RPTMonth)&\" \"&VALUE((LEFT(CRY,2))&RIGHT(CRY,2)),CONCATENATE(dms_RPTMonth)&\" \"&VALUE((LEFT(dms_CRCP_FinalYear_Result,2)&RIGHT(dms_CRCP_FinalYear_Result,2))))","v":"June 2018"},"dms_DollarReal","=IF(SUM(dms_SingleYear_Model)>0,CONCATENATE(dms_RPTMonth)&\" \"&VALUE((LEFT(CRY,2))&RIGHT(CRY,2)),CONCATENATE(dms_RPTMonth)&\" \"&VALUE((LEFT(dms_CRCP_FinalYear_Result,2)&RIGHT(dms_CRCP_FinalYear_Result,2))))"]
[null,"Dollar $ real previous year (PRCP_y5)",{"$f":"IF(SUM(dms_SingleYear_Model)>0,CONCATENATE(dms_RPTMonth)&\" \"&VALUE(((LEFT(CRY,2))&RIGHT(CRY,2))-1),CONCATENATE(dms_RPTMonth)&\" \"&VALUE(((LEFT(dms_CRCP_FirstYear_Result,2)&RIGHT(dms_CRCP_FirstYear_Result,2))))-1)","v":"June 2017"},"dms_DollarReal_Prev","=IF(SUM(dms_SingleYear_Model)>0,CONCATENATE(dms_RPTMonth)&\" \"&VALUE(((LEFT(CRY,2))&RIGHT(CRY,2))-1),CONCATENATE(dms_RPTMonth)&\" \"&VALUE(((LEFT(dms_CRCP_FirstYear_Result,2)&RIGHT(dms_CRCP_FirstYear_Result,2))))-1)"]
[null,"This block works out the various RYE's for ALL RIN types and MODELS"]
[null,"Single Year Model T/F",{"$f":"IF(dms_Model=\"EB\",1,0)","v":0},"dms_EB"]
[null,null,{"$f":"IF(dms_Model=\"CA\",1,0)","v":0},"dms_CA","=dms_SingleYear_Model"]
[null,null,{"$f":"IF(dms_Model=\"ARR\",1,0)","v":1},"dms_ARR"]
[null,"Is this a single Year RIN?",{"$f":"IF(SUM(dms_SingleYear_Model)=1,\"yes\",\"no\")","v":"yes"},"dms_SingleYearModel","=IF(SUM(dms_SingleYear_Model)=1,\"yes\",\"no\")"]
[null,"Single Year Final Year Reference","CRY","dms_SingleYear_FinalYear_Ref","This is the reference for EB, CA & ARR RINs"]
[null,"Single Year Final Year Result",{"$f":"IFERROR(IF(SUM(dms_SingleYear_Model)<>0,(INDIRECT(dms_SingleYear_FinalYear_Ref)),\"not a single year RIN\"),\"CRY not present\")","v":"2017-18"},"dms_SingleYear_FinalYear_Result","=IFERROR(IF(SUM(dms_SingleYear_Model)<>0,(INDIRECT(dms_SingleYear_FinalYear_Ref)),\"not a single year RIN\"),\"CRY not present\")"]
[null,"FRCP length in years",{"$f":"INDEX(dms_FRCPlength_List,MATCH(dms_TradingName,dms_TradingName_List))","v":5},"dms_FRCPlength_Num","=INDEX(dms_FRCPlength_List,MATCH(dms_TradingName,dms_TradingName_List))"]
[null,"Multi Year Final Year Reference",{"$f":"INDEX(dms_FinalYear_List,MATCH(dms_FRCPlength_Num,dms_FRCPlength_Num_List))","v":"dms_FRCP_y5"},"dms_MultiYear_FinalYear_Ref","=INDEX(dms_FinalYear_List,MATCH(dms_FRCPlength_Num,dms_FRCPlength_Num_List))"]
[null,"Multi Year Final Year Result",{"$f":"IF(dms_MultiYear_Flag=0,INDIRECT(dms_MultiYear_FinalYear_Ref),dms_Specified_FinalYear)","v":"2024-25"},"dms_MultiYear_FinalYear_Result","=IF(dms_MultiYear_Flag=0,INDIRECT(dms_MultiYear_FinalYear_Ref),dms_Specified_FinalYear)",null,null,null,"Formula errors OK"]
[null,"CRCP length in years",{"$f":"INDEX(dms_CRCPlength_List,MATCH(dms_TradingName,dms_TradingName_List))","v":5},"dms_CRCPlength_Num","=INDEX(dms_CRCPlength_List,MATCH(dms_TradingName,dms_TradingName_List))"]
[null,"CRCP Final Year Reference",{"$f":"INDEX(dms_CFinalYear_List,MATCH(dms_CRCPlength_Num,dms_CRCPlength_Num_List))","v":"CRCP_y5"},"dms_CRCP_FinalYear_Ref","=INDEX(dms_CFinalYear_List,MATCH(dms_CRCPlength_Num,dms_CRCPlength_Num_List))"]
[null,"CRCP First Year Result",{"$f":"INDEX(dms_CRCP_years,MATCH(dms_CRCPlength_Num,dms_CRCP_index))","v":"2015-16"},"dms_CRCP_FirstYear_Result","=INDEX(dms_CRCP_years,MATCH(dms_CRCPlength_Num,dms_CRCP_index))"]
[null,"CRCP Final Year Result",{"$f":"IF(dms_MultiYear_Flag=0,(IF(SUM(dms_SingleYear_Model)>0,CRY,dms_CRCP_yZ)),dms_Specified_FinalYear)","v":"2017-18"},"dms_CRCP_FinalYear_Result","=IF(dms_MultiYear_Flag=0,(IF(SUM(dms_SingleYear_Model)>0,CRY,dms_CRCP_yZ)),dms_Specified_FinalYear)"]
[null,"PTRM/ RFMs"]
[null,"Form of control",{"$f":"INDEX(dms_FormControl_List,MATCH(dms_TradingName,dms_TradingName_List))","v":"Revenue cap"},"dms_FormControl","=INDEX(dms_FormControl_List,MATCH(dms_TradingName,dms_TradingName_List))"]
[null,"ABC RINS THAT SPAN MULTIPLE YEARS"]
[null,"Is this a multi year ABC RIN?","No"]
[null,"Multiyear EB, CA or ARR?",{"$f":"IF(dms_MultiYear_ResponseFlag=\"No\",0,1)","v":0},"dms_MultiYear_Flag","This is set from the answer provided above"]
[null,null,{"$f":"IF(dms_MultiYear_Flag=1,FRY,\"not a Multiple year submission\")","v":"not a Multiple year submission"},"dms_Specified_FinalYear","The result here is returned to dms_CRCP_FinalYear_Result if response to Q in C73 is \"yes\" and dms_MultiYear_Flag is set to 1"]
[null," Start year for 5.2 in Multi year ABC RINS",{"$f":"IFERROR(IF(dms_MultiYear_Flag=1,FRY,CRY),\"not an ABC\")","v":"2017-18"},"dms_0502_Inst_Year","=IF(dms_MultiYear_Flag=1,FRY,CRY)",null,"For single year RINS this is CRY - multi year RINS need to start a the end of the span of years (ie. FRY)"]
[null,"EB RINS"]
[null,"Calendar Year for table 3.6 data",{"$f":"IF(dms_RPT=\"financial\",VALUE(LEFT(dms_SingleYear_FinalYear_Result,4)),VALUE(LEFT(dms_SingleYear_FinalYear_Result,4)-1))","v":2017},"dms_0306_Year","=IF(dms_RPT=\"financial\",VALUE(LEFT(dms_SingleYear_FinalYear_Result,4)),VALUE(LEFT(dms_SingleYear_FinalYear_Result,4)-1))"]
[null,"CA RINS"]
[null,"Find how many rows in tables 6.3 sustained interruptions?",null,null,"dms_060301_MaxRows only returns a valid value when cover sheet is attached to a CA file"]
[null,null,{"$f":"IF(dms_Model<>\"CA\",\"not a CA\",\"Is a CA\")","v":"not a CA"},null,"=IF(dms_Model<>\"CA\",\"not a CA\",\"Is a CA\")"]
[null,"dms_060301_Avg_Duration_Sustained_Int_Values present?",{"$f":"IFERROR(IF(INDEX(dms_060301_Avg_Duration_Sustained_Int_Values,1,1)<>\"\",\"yes\",\"no\"),\"no\")","v":"no"},"dms_060301_checkvalue","=IFERROR(IF(INDEX(dms_060301_Avg_Duration_Sustained_Int_Values,1,1)<>\"\",\"yes\",\"no\"),\"no\")"]
[null,null,{"$f":"IF(AND(dms_Model=\"CA\",(dms_060301_checkvalue=\"no\")),\"error - NR not present\",\"no errors\")","v":"no errors"},null,"=IF(AND(dms_Model=\"CA\",(dms_060301_checkvalue=\"no\")),\"error - NR not present\",\"no errors\")"]
[null,"Table 6.3.1 - last row reference",{"$f":"IFERROR(IF(dms_Model=\"CA\",LOOKUP(2,1/(dms_060301_Avg_Duration_Sustained_Int_Values<>\"\"),(ROW(dms_060301_Avg_Duration_Sustained_Int_Values))),\"not a CA\"),\"6.3 not present\")","v":"not a CA"},"dms_060301_LastRow","=IFERROR(IF(dms_Model=\"CA\",LOOKUP(2,1/(dms_060301_Avg_Duration_Sustained_Int_Values<>\"\"),(ROW(dms_060301_Avg_Duration_Sustained_Int_Values))),\"not a CA\"),\"6.3 not present\")"]
[null,"Table 6.3.1 - max number rows",{"$f":"IFERROR(IF(dms_Model=\"CA\",(dms_060301_LastRow-15),\"not a CA\"),\"error\")","v":"not a CA"},"dms_060301_MaxRows","=IFERROR(IF(dms_Model=\"CA\",(dms_060301_LastRow-15),\"not a CA\"),\"error\")"]
[null,"Table 6.6.3 - Public lighting repair - no. business days",{"$f":"INDEX(dms_663_List,MATCH(dms_TradingName,dms_TradingName_List))","v":5},"dms_663","=INDEX(dms_663_List,MATCH(dms_TradingName,dms_TradingName_List))"]
[null,"ARR or RESET RINS"]
[null,"How many rows in tables 6.1 or 6.7?  (leap year?)","insert dms_LeapYear NR if required",null,"'dms_LeapYear is used to determine dms_060701_Max_Rows BUT it is only found on worksheet 6.1 or 6.7 and the date value in the cell is used to determine whether it is a leap year"]
[null,"Is dms_LeapYear named range present?",{"$f":"IFERROR(IF(dms_LeapYear,\"yes\"),\"no\")","v":"yes"}]
[null,"Table 6.7.1 - includes a leap year?",{"$f":"\nIFERROR(IF(MONTH(DATE(YEAR(dms_LeapYear),2,29))=2,\"is a leap year\",\"not a leap year\"),\n\"dms_LeapYear not present\")","v":"not a leap year"},"dms_LeapYear_Result","=IFERROR(IF(MONTH(DATE(YEAR(dms_LeapYear),2,29))=2,\"is a leap year\",\"not a leap year\"),\"dms_LeapYear not present\")"]
[null,"MaxRows if Reset and leap year",{"$f":"IF(dms_LeapYear_Result=\"is a leap year\",1827,1826)","v":1826},"dms_060701_Reset_MaxRows","=IF(dms_LeapYear_Result=\"is a leap year\",1827,1826)",null,null,"number of days present in Reset RIN table"]
[null,"MaxRows if ARR and leap year",{"$f":"IF(dms_LeapYear_Result=\"is a leap year\",366,365)","v":365},"dms_060701_ARR_MaxRows","=IF(dms_LeapYear_Result=\"is a leap year\",366,365)",null,null,"number of days present in ARR RIN table"]
[null,"Table 6.7.1 - Max Rows (leap year/ non leap year)",{"$f":"IF(dms_Model=\"ARR\",dms_060701_ARR_MaxRows,IF(dms_Model=\"Reset\",dms_060701_Reset_MaxRows,\"not a relevant RIN type\"))","v":365},"dms_060701_MaxRows","=IF(dms_Model=\"ARR\",dms_060701_ARR_MaxRows,IF(dms_Model=\"Reset\",dms_060701_Reset_MaxRows,\"not a relevant RIN type\"))"]
[null,"How many columns in 6.7?   (4 or 5 feeder categories)",{"$f":"IF(dms_FifthFeeder_flag_NSP=\"NO\",\"This NSP has only 4 feeder categories\",\"This NSP has 5 feeder categories\")","v":"This NSP has only 4 feeder categories"}]
[null,"Table 6.7.1 - Last column (# of feeder categories > 4)",{"$f":"IF(dms_FifthFeeder_flag_NSP=\"NO\",10,12)","v":10},"dms_060701_MaxCols","=IF(dms_FifthFeeder_flag_NSP=\"NO\",8,10)"]
[null,"Table 6.7.1 - Number of offset rows",{"$f":"IF(dms_Model=\"ARR\",15,9)","v":15},"dms_060701_OffsetRows","=IF(dms_Model=\"ARR\",15,9)"]
[null,"Start date for telephone answering in 6.1 or 6.7?",null,null,"Using 060101 as naming standard not 060701 for start dates"]
[null,"Table 6.1.1 and 6.7.1 - Start Date as Text",{"$f":"IF(dms_SingleYearModel=\"yes\",(CONCATENATE(IF(LEN(CRY)=4,\"1-Jan-\",\"1-Jul-\"),LEFT(CRY,4))),(CONCATENATE(IF(LEN(PRCP_y4)=4,\"1-Jan-\",\"1-Jul-\"),LEFT(PRCP_y4,4))))","v":"1-Jul-2017"},"dms_060101_StartDateTxt","=IF(SUM(dms_SingleYear_Model)>1,(CONCATENATE(IF(LEN(CRY)=4,\"1-Jan-\",\"1-Jul-\"),LEFT(CRY,4))),(CONCATENATE(IF(LEN(CRCP_y4)=4,\"1-Jan-\",\"1-Jul-\"),LEFT(CRCP_y4,4))))"]
[null,"Table 6.1.1 and 6.7.1 - Start Date as Date Value",{"$f":"DATEVALUE(dms_060701_StartDateTxt)","v":42917},"dms_060101_StartDateVal","=DATEVALUE(dms_060701_StartDateTxt)"]
[null,"ARRs"]
[null,"How many rows in table 6.8?","insert dms_060801_StartCell NR if required",null,"dms_060801_StartCell is only found on worksheet 6.8 and is used to determine the starting date for the date range"]
[null,"Is dms_060801_StartCell named range present?","yes",null,"=IFERROR(IF((ROW(dms_060801_StartCell)-1)=1,\"yes\",\"yes\"),\"no\")"]
[null,"Table 6.8 - Number of offset rows",{"$f":"IFERROR(IF(dms_Model=\"ARR\",(ROW(dms_060801_StartCell)-1),\"not an ARR\"),\"6.8 error\")","v":11},"dms_0608_OffsetRows","=IFERROR(IF(dms_Model=\"ARR\",(ROW(dms_060801_StartCell)-1),\"not an ARR\"),\"6.8 error\")"]
[null,"Table 6.8 - Last row",{"$f":"IFERROR(IF(dms_060801_StartCell<>\"\",IF(dms_Model=\"ARR\",(LOOKUP(2,1/(dms_060801_01_Values<>\"\"),(ROW(dms_060801_01_Values)))),\"not an ARR\"),0),\"6.8 not present\")","v":0},"dms_0608_LastRow","=IFERROR(IF(dms_060801_StartCell<>\"\",IF(dms_Model=\"ARR\",(LOOKUP(2,1/(dms_060801_01_Values<>\"\"),(ROW(dms_060801_01_Values)))),\"not an ARR\"),0),\"6.8 not present\")"]
[null,"Table 6.8 - MaxRows",{"$f":"IFERROR(IF(dms_Model=\"ARR\",(MAX(0,dms_0608_LastRow-dms_0608_OffsetRows)),\"not an ARR\"),\"6.8 not present\")","v":0},"dms_060801_MaxRows","=IFERROR(IF(dms_Model=\"ARR\",(MAX(0,dms_0608_LastRow-dms_0608_OffsetRows)),\"not an ARR\"),\"6.8 not present\")"]
[null,"TNSP RESET RINS"]
[null,"Table 7.9.4 only appears in TNSPs Reset RIN"]
[null,"Table 7.9.4 - first year",{"$f":"LEFT(PRCP_y3,4)","v":"2012"},"dms_070904_Start_Year","=LEFT(PRCP_y3,4)"]
[null,"SUBSET FILES"]
[null,"Is this Submission File a Subset File","NO","dms_Partial"]
[null,"MISC"]
[null,"Distribution Determination Reference",{"$f":"INDEX(dms_DeterminationRef_List,MATCH(dms_TradingName,dms_TradingName_List))","v":"2014-19 Distribution Determination"},"dms_DeterminationRef"]
[null,"Public lighting NSP?",{"$f":"INDEX(dms_Public_Lighting_List,MATCH(dms_TradingName,dms_TradingName_List))","v":"YES"},"dms_Public_Lighting","=INDEX(dms_Public_Lighting_List,MATCH(dms_TradingName,dms_TradingName_List))"]
[null,"CBD Feeder for this business",{"$f":"INDEX(dms_CBD_flag,MATCH(dms_TradingName,dms_TradingName_List))","v":"NO"},"dms_CBD_flag_NSP"]
[null,"Urban Feeder for this business",{"$f":"INDEX(dms_Urban_flag,MATCH(dms_TradingName,dms_TradingName_List))","v":"YES"},"dms_Urban_flag_NSP"]
[null,"Short rural Feeder for this business",{"$f":"INDEX(dms_ShortRural_flag,MATCH(dms_TradingName,dms_TradingName_List))","v":"YES"},"dms_ShortRural_flag_NSP"]
[null,"Long rural Feeder for this business",{"$f":"INDEX(dms_LongRural_flag,MATCH(dms_TradingName,dms_TradingName_List))","v":"YES"},"dms_LongRural_flag_NSP"]
[null,"Fifth Feeder Category (eg. TasNetworks (D))",{"$f":"INDEX(dms_FeederType_5_flag,MATCH(dms_TradingName,dms_TradingName_List))","v":"NO"},"dms_FifthFeeder_flag_NSP","=INDEX(dms_FeederType_5_flag,MATCH(dms_TradingName,dms_TradingName_List))"]
[]
[null,"DISCARD FILES"]
[null,"discard this record?","NO","dms_DISCARD","If record is to be discarded from DB set this flag to YES"]
[]
[null,"USES NAMED RANGES FLAG","yes","dms_Defined_Names_Used"]
[]
[null,"REGULATORY YEARS FOR MULTI RYE SUBMISSIONS"]
[null,"Multiple RYE flag","NO","dms_Multi_RYE_flag"]
[null,null,"Manually specify RYE","Named ranges to apply"]
[null,null,2013,"dms_RYE_01"]
[null,null,2014,"dms_RYE_02"]
[null,null,2015,"dms_RYE_03"]
[null,null,2016,"dms_RYE_04"]
[null,null,2017,"dms_RYE_05"]
[null,null,2018,"dms_RYE_06"]
[null,null,2019,"dms_RYE_07"]
[null,null,2020,"dms_RYE_08"]
[null,null,2021,"dms_RYE_09"]

{"sheet":"2.11 Labour","index":5,"n_rows":36,"n_cols":4,"rows_kept":36,"cut":false,"hidden":false,"merged":[]}
[null,{"$f":"IF(dms_DataQuality=\"backcast\",INDEX(dms_Worksheet_List,MATCH(dms_Model,dms_Model_List))&\" BACKCAST\",INDEX(dms_Worksheet_List,MATCH(dms_Model,dms_Model_List)))","v":"ANNUAL REPORTING STATEMENT"}]
[null,{"$f":"INDEX(dms_TradingNameFull_List,MATCH(dms_TradingName,dms_TradingName_List))","v":"Endeavour Energy"}]
[null,{"$f":"CONCATENATE(\"Annual Reporting RIN Response \",IF(SUM(dms_SingleYear_Model)>0,CONCATENATE(CRY),CONCATENATE(FRCP_y1,\" to \",dms_MultiYear_FinalYear_Result)))","v":"Annual Reporting RIN Response 2017-18"}]
[null,"2.11 LABOUR "]
[]
[null,"Tables 2.11.1 and 2.11.2 deliberately omitted."]
[]
[null,"2.11.3 - LABOUR / NON-LABOUR EXPENDITURE SPLIT"]
[null,"2.11.3.1 - Opex"]
[null,null,{"$f":"CRY","v":"2017-18"}]
[null,null,"$0's, nominal"]
[null,null,"Opex "]
[null,"In-house labour expenditure",129800627.42742798]
[null,"Labour expenditure outsourced to related parties",0]
[null,"Labour expenditure outsourced to unrelated parties",76187547.057852089]
[null,"Controllable non-labour expenditure",47093702.064628094]
[null,"Uncontrollable non-labour expenditure",4241021.6344722118]
[null,"Total",{"$f":"SUM(C13:C17)","v":257322898.18438038}]
[]
[null,"Reconciliation with Opex worksheets - SCS","Opex"]
[null,"Total including margins",{"$f":"dms_Total_Actual_Opex","v":257322898.18438035},{"$f":"IF(ROUND(C18,0)=ROUND(dms_Total_Actual_Opex,0),\"OK\",\"Error\")","v":"OK"}]
[]
[]
[null,"2.11.3.2 - Capex"]
[null,null,{"$f":"CRY","v":"2017-18"}]
[null,null,"$0's, nominal"]
[null,null,"Capex"]
[null,"In-house labour expenditure",76317373.117855743]
[null,"Labour expenditure outsourced to related parties",0]
[null,"Labour expenditure outsourced to unrelated parties",102800267.51612289]
[null,"Controllable non-labour expenditure",171698739.00984052]
[null,"Uncontrollable non-labour expenditure",147777114.24257699]
[null,"Total",{"$f":"SUM(C28:C32)","v":498593493.88639617}]
[]
[null,"Reconciliation with Capex & Opex worksheets - SCS","Capex"]
[null,"Total including margins",{"$f":"dms_Total_Actual_Capex","v":498593494.38257724},{"$f":"IF(ROUND(C33,0)=ROUND(dms_Total_Actual_Capex,0),\"OK\",\"Error\")","v":"OK"}]

{"sheet":"3.6 Quality of services","index":6,"n_rows":74,"n_cols":4,"rows_kept":74,"cut":false,"hidden":false,"merged":[]}
[null,{"$f":"IF(dms_DataQuality=\"backcast\",INDEX(dms_Worksheet_List,MATCH(dms_Model,dms_Model_List))&\" BACKCAST\",INDEX(dms_Worksheet_List,MATCH(dms_Model,dms_Model_List)))","v":"ANNUAL REPORTING STATEMENT"}]
[null,{"$f":"INDEX(dms_TradingNameFull_List,MATCH(dms_TradingName,dms_TradingName_List))","v":"Endeavour Energy"}]
[null,{"$f":"CONCATENATE(\"Annual Reporting RIN Response \",IF(SUM(dms_SingleYear_Model)>0,CONCATENATE(CRY),CONCATENATE(FRCP_y1,\" to \",dms_MultiYear_FinalYear_Result)))","v":"Annual Reporting RIN Response 2017-18"}]
[null,"3.6 QUALITY OF SERVICES"]
[]
[null,"3.6.5 - QUALITY OF SUPPLY METRICS"]
[null,null,null,"Volume"]
[null,null,"Units",{"$f":"CRY","v":"2017-18"}]
[null,"Over voltage events - due to high voltage injection","number"]
[null,"Customers receiving over-voltage - due to high voltage injection","number"]
[null,"Over voltage events - due to lightning","number"]
[null,"Customers receiving over-voltage - due to lightning","number"]
[null,"Over voltage events - due to voltage regulation or other cause","number"]
[null,"Customers receiving over-voltage - due to voltage regulation or other cause","number"]
[null,"Voltage variations - steady state (zone sub)","number"]
[null,"Voltage variations - one minute (zone sub)","number"]
[null,"Voltage variations - 10 seconds (zone sub) Min<0.7","number"]
[null,"Voltage variations - 10 seconds (zone sub) Min<0.8","number"]
[null,"Voltage variations - 10 seconds (zone sub) Min<0.9","number"]
[null,"Voltage variations - steady state (feeder)","number"]
[null,"Voltage variations - % zone subs monitored","(per cent)"]
[null,"Voltage variations - % feeders monitored","(per cent)"]
[]
[null,"3.6.6 - COMPLAINTS - TECHNICAL QUALITY OF SUPPLY"]
[null,null,null,"Volume"]
[null,null,"Units",{"$f":"CRY","v":"2017-18"}]
[null,"3.6.6.1 - TECHNICAL QUALITY OF SUPPLY"]
[null,"Number of complaints - technical quality of supply","number",16]
[null,"3.6.6.2 - PERCENTAGE OF COMPLAINTS BY CATEGORY"]
[null,"Low voltage supply","(per cent)"]
[null,"Voltage dips","(per cent)"]
[null,"Voltage swell","(per cent)"]
[null,"Voltage spike (impulsive transient)","(per cent)"]
[null,"Waveform distortion","(per cent)"]
[null,"TV or radio interference","(per cent)"]
[null,"Solar related","(per cent)"]
[null,"Noise from appliances","(per cent)"]
[null,"Other","(per cent)"]
[null,"3.6.6.3 - PERCENTAGE OF COMPLAINTS BY LIKELY CAUSE"]
[null,"Network equipment faulty","(per cent)"]
[null,"Network interference by NSP equipment","(per cent)"]
[null,"Network interference by another customer","(per cent)"]
[null,"Network limitation","(per cent)"]
[null,"Customer internal problem","(per cent)"]
[null,"No problem identified","(per cent)"]
[null,"Environmental","(per cent)"]
[null,"Other","(per cent)"]
[]
[]
[]
[null,"3.6.7 - CUSTOMER SERVICE METRICS"]
[null,null,null,"Volume"]
[null,null,"Unit",{"$f":"CRY","v":"2017-18"}]
[null,"3.6.7.1 - TIMELY PROVISIONS OF SERVICES"]
[null,"Number of connections made","number",0]
[null,"Number of connections not made on or before agreed date","number",0]
[null,"3.6.7.2 - TIMELY REPAIR OF FAULTY STREET LIGHTS"]
[null,"Street lights - average monthly number \"out\"","number",1194]
[null,"Street lights - not repaired by \"fix by\" date","number",126]
[null,"Street lights - average number of days to repair","number",4.8]
[null,"Total number of street lights","number",205292]
[null,"3.6.7.3 - CALL CENTRE PERFORMANCE"]
[null,"Calls to call centre fault line","number",{"$f":"IF(SUM(dms_060101_Values)=0,\"\",SUM(dms_060102_Values))","v":186189}]
[null,"Calls to fault line answered within 30 seconds","number",{"$f":"IF(SUM(dms_060102_Values)=0,\"\",SUM(dms_060102_Values))","v":186189}]
[null,"Calls to fault line - average waiting time before call answered","number",20]
[null,"Call centre - number of overload events","number",0]
[null,"Percentage of calls abandoned","(per cent)",4.1500000000000002E-2]
[null,"3.6.7.4 - NUMBER OF CUSTOMER COMPLAINTS"]
[null,"Complaint - reliability of supply","number"]
[null,"Complaint - technical quality of supply","number",{"$f":"IF(ISBLANK(dms_030606_01_Values),\"\",dms_030606_01_Values)","v":16}]
[null,"Complaint - administrative process or customer service","number"]
[null,"Complaint - connection or augmentation","number"]
[null,"Complaint - other","number"]
[null,"Total number of complaints","number",{"$f":"IF(SUM(D69:D73)=0,\"\",(SUM(D69:D73)))","v":16}]

{"sheet":"3.6.8 Network-feeders","index":7,"n_rows":1548,"n_cols":23,"rows_kept":1548,"cut":false,"hidden":false,"merged":[[10,10,10,14],[11,11,11,12],[11,13,11,14],[11,18,11,19],[11,15,12,15],[11,10,12,10],[10,15,10,19],[11,16,11,17],[5,6,5,8],[5,1,5,4],[11,8,12,8],[11,9,12,9],[11,20,12,20],[10,20,10,22],[11,21,11,22],[10,1,12,1],[10,2,12,2],[10,3,12,3],[10,4,12,4],[10,7,12,7],[11,5,12,5],[11,6,12,6],[10,5,10,6],[10,8,10,9]]}
[null,{"$f":"IF(dms_DataQuality=\"backcast\",INDEX(dms_Worksheet_List,MATCH(dms_Model,dms_Model_List))&\" BACKCAST\",INDEX(dms_Worksheet_List,MATCH(dms_Model,dms_Model_List)))","v":"ANNUAL REPORTING STATEMENT"}]
[null,{"$f":"INDEX(dms_TradingNameFull_List,MATCH(dms_TradingName,dms_TradingName_List))","v":"Endeavour Energy"}]
[null,{"$f":"CONCATENATE(\"Annual Reporting RIN Response \",IF(SUM(dms_SingleYear_Model)>0,CONCATENATE(CRY),CONCATENATE(FRCP_y1,\" to \",dms_MultiYear_FinalYear_Result)))","v":"Annual Reporting RIN Response 2017-18"}]
[null,"3.6 QUALITY OF SERVICES"]
[]
[null,"Did the MAIFI parameter of the STPIS apply during the period?",null,null,null,"No","** IMPORTANT\nPlease ensure this question is answered correctly. Your response will affect other tables throughout this workbook and will determine which cells are grey and which are input cells. "]
[]
[]
[]
[null,"3.6.8 - NETWORK FEEDER RELIABILITY"]
[null,"Feeder ID / name","Description of the service area for the feeder","Feeder classification\n\n(drop down)","Number of distribution customers","Length of high voltage distribution lines",null,"Maximum demand\n(MVA)","Energy not supplied\n(MWh)",null,"Unplanned Outages",null,null,null,null,"Planned Outages",null,null,null,null,"Momentary feeder outages"]
[null,null,null,null,null,"Overhead","Underground",null,"Unplanned","Planned","Total number of unplanned outages","Unplanned customer minutes off-supply (SAIDI)",null,"Unplanned interruptions\n(SAIFI)",null,"Total number of planned outages","Planned customer minutes off-supply (SAIDI)",null,"Planned interruptions\n(SAIFI)",null,"Total number of momentary feeder outages","Momentary interruptions due to feeder outages (MAIFI)"]
[null,null,null,null,null,null,null,null,null,null,null,"Including excluded events and MEDs","After removing excluded events and MED","Including excluded events and MEDs","After removing excluded events and MED",null,"Including MEDs","After removing  MED","Including MEDs","After removing  MED",null,"Including excluded events and MEDs","After removing excluded events and MED"]
[null,"(unknown JAMBEROO)","JAMBEROO","Short rural",0,0,0,0,0,2.6224386015755861E-2,0,0,0,0,0,1,6.5391820720370432E-3,6.5391820720370432E-3,1.7673465059559576E-5,"1.767346506e-05"]
[null,"(unknown KATOOMBA)","KATOOMBA","Urban",0,0,0,0,0,0.19647026496128445,0,0,0,0,0,2,1.8929099187933451E-2,1.8929099187933451E-2,5.3263699013665555E-5,"5.3263699014e-05"]
[null,"(unknown NORTH ROCKS)","NORTH ROCKS","Urban",0,0,0,0,0,1.0206247530456335E-2,0,0,0,0,0,1,9.8332982794459485E-4,9.8332982794459485E-4,2.7314717442905412E-6,"2.7314717443e-06"]
[null,"10241","KATOOMBA","Short rural",1174,10.173875957251498,0.19880168209996402,2.3244121837574334,2.3325244703550001,3.3775591653914319,3,0.58162666572300004,0.58162666572408184,4.6940723198190233E-3,4.6940723198190233E-3,10,0.84221130394825205,0.84221130394825205,2.502562652433636E-3,"0.0025025626524"]
[null,"10242","KATOOMBA","Urban",1352,8.5066436358593993,0.91124675019263301,1.5432572695438695,0.76198143020910003,0.57495194421570683,2,7.3413766071260003E-2,7.3413766071296876E-2,7.3613163508630083E-4,7.3613163508630083E-4,4,5.5394246974212177E-2,5.5394246974212177E-2,1.4067079483096287E-4,"0.00014067079483"]
[null,"10244","KATOOMBA","Short rural",933,22.278112910798402,3.1203714749909301,1.2955740040615202,1.681008680013,2.523919962219098,6,0.41916793845470002,0.41916793844945416,2.132129046697098E-3,2.132129046697098E-3,10,0.62935209077091658,0.62935209077091658,1.5057792230744761E-3,"0.0015057792231"]
[null,"10245","KATOOMBA","Short rural",905,9.821544275954869,0.50771321846126893,1.2955740040615202,0.1853851461129,2.3594009221656589,5,4.622671520978E-2,4.6226715209784025E-2,4.9839171467957999E-4,4.9839171467957999E-4,8,0.58832844367466686,0.58832844367466686,2.170301509313916E-3,"0.0021703015093"]
[null,"10247","KATOOMBA","Urban",457,2.4857088888282999E-2,2.6088312742069704,3.3151452456868307,0.67026746241000001,0.24877728355487316,1,6.4577503780999995E-2,6.4577503781059822E-2,6.0352807272018533E-4,6.0352807272018533E-4,4,2.3968664556149499E-2,2.3968664556149499E-2,5.0532227269375015E-5,"5.0532227269e-05"]
[null,"10248","KATOOMBA","Short rural",1160,6.22981338606081,1.9123687265432801,1.6385200639601578,0.61305526833000001,0.31554315281660839,2,0.15286840338000002,0.15286840337916652,6.7866105828708772E-4,6.7866105828708772E-4,1,7.8682266445159244E-2,7.8682266445159244E-2,1.8733872963133151E-4,"0.00018733872963"]
[null,"10250","KATOOMBA","Short rural",1013,6.8046664793961602,5.0339698898211704,2.4958852137067522,4.4504484109540003,0.26561759198012613,5,1.1097416139360001,1.1097416139408292,7.6561450638012087E-3,7.6561450638012087E-3,2,6.6233077657205472E-2,6.6233077657205472E-2,2.1208158071471493E-4,"0.00021208158071"]
[null,"10251","KATOOMBA","Short rural",1392,8.6174904728018191,0.99150015597179098,1.7147302994931883,2.2970289029543496,1.8753979837213517,7,0.57277566811512015,0.57277566811457425,4.9842463114914927E-3,4.9842463114914927E-3,6,0.46763988547594643,0.46763988547594643,1.0992895267046057E-3,"0.0010992895267"]
[null,"10286","NORTH RICHMOND","Short rural",666,19.003433746910801,8.6870599999999989,2.8769363913719053,5.2732278907E-3,0.63278734688829275,2,1.31490580043E-3,1.3149058004312325E-3,2.1208158071471491E-5,2.1208158071471491E-5,7,0.15778869605174792,0.15778869605174792,3.3933052914354386E-4,"0.00033933052914"]
[null,"10287","NORTH RICHMOND","Urban",954,4.38476,0.74519267958397906,4.3058783076162293,0.10940530338899999,1.7852427972023206,2,1.05407494612E-2,1.0540749461217198E-2,1.3793932308667233E-4,1.3793932308667233E-4,2,0.17200077573797537,0.17200077573797537,3.7421162896780416E-4,"0.00037421162897"]
[null,"10289","NORTH RICHMOND","Short rural",89,6.3257989642794001,0.20999000000000001,0.49536653096469885,0.35373152899229998,0.15564527483945911,4,8.8204729418699987E-2,8.820472941924995E-2,9.614364992400411E-4,9.614364992400411E-4,1,3.8810929270792834E-2,3.8810929270792834E-2,1.2724894842882896E-4,"0.00012724894843"]
[null,"10290","NORTH RICHMOND","Short rural",352,15.834094764726201,0.53781091741404308,3.5437759522859222,4.5247697385100004E-2,0.9662623096021612,3,1.1282740094E-2,1.1282740094022834E-2,8.9074263900180267E-4,8.9074263900180267E-4,4,0.24094234915697571,0.24094234915697571,6.5038351419179248E-4,"0.00065038351419"]
[null,"16647","NORTH PARRAMATTA","Urban",246,0,1.1838332587228899,3.1790540877543201,2.5923726974000001,0,1,0.24976441056000001,0.24976441056205495,3.3597102454773658E-4,3.3597102454773658E-4,0,0,0,0,"0"]
[null,"16649","NORTH PARRAMATTA","Urban",1824,2.4511555747226699,3.78342499852078,3.0293568624379663,7.2818741061000003E-2,1.8267056777947994,1,7.0157851752000004E-3,7.0157851752102552E-3,8.3309888200861504E-5,8.3309888200861504E-5,2,0.17599555316400028,0.17599555316400028,3.714801572235136E-4,"0.00037148015722"]
[null,"16651","NORTH PARRAMATTA","Urban",1157,0,2.5846407495718902,3.9118713899104605,5.7707824578E-2,0.43376552004439423,1,5.5599107354999998E-3,5.5599107355033964E-3,3.1411925059341222E-5,3.1411925059341222E-5,1,4.1791517687645281E-2,4.1791517687645281E-2,2.0895758843822641E-4,"0.00020895758844"]
[null,"16653","NORTH PARRAMATTA","Urban",1589,5.2248167581635094,2.3468499999999999,3.7301760270349842,2.3749512742779997,0.36529860952758297,4,0.22881675375190003,0.22881675375509078,4.3853778854584637E-3,4.3853778854584637E-3,2,3.5195013425183622E-2,3.5195013425183622E-2,8.4675624073006771E-5,"8.4675624073e-05"]
[null,"16660","NORTH PARRAMATTA","Urban",1325,6.1590900931143695,1.7160041150505498,5.4028281151491893,2.0055276397399999,0,3,0.19322431119,0.19322431119111289,1.9120302210033789E-3,1.9120302210033789E-3,0,0,0,0,"0"]
[null,"16662","NORTH PARRAMATTA","Urban",386,0,2.2086699729964199,2.9456170556342722,0,1.2757809413070419E-3,0,0,0,0,0,1,1.2291622849307436E-4,1.2291622849307436E-4,4.097207616435812E-6,"4.0972076164e-06"]
[null,"16664","NORTH PARRAMATTA","Urban",21,0,1.9473800000000001,3.9314320170306123E-2,0,0,0,0,0,0,0,0,0,0,0,"0"]
[null,"16666","NORTH PARRAMATTA","Urban",1953,1.7755647833379,5.2744499999999999,3.8105117766515302,0.88678115696000004,9.7809872166873205E-3,1,8.5437704690000005E-2,8.5437704689663843E-2,2.1332794322909128E-3,2.1332794322909128E-3,1,9.423577517802367E-4,9.423577517802367E-4,1.3657358721452706E-6,"1.3657358721e-06"]
[null,"17058","ARNDELL PARK","Urban",967,2.3346338160090201,2.1105648625578701,2.6430319364739279,0,1.4786301109748616,0,0,0,0,0,2,0.14245990882347317,0.14245990882347317,2.6222128745189197E-4,"0.00026222128745"]
[null,"17059","ARNDELL PARK","Urban",55,0.13587861545339502,1.9061596256601299,2.8007261558388743,0,4.2526031376901394E-3,0,0,0,0,0,1,4.0972076164358119E-4,4.0972076164358119E-4,1.3657358721452706E-6,"1.3657358721e-06"]
[null,"17061","ARNDELL PARK","Urban",841,2.1214348713014202,5.0378874848007698,2.0576763593918259,0.69589597744520004,2.903890052571712,6,6.704670543499E-2,6.7046705435355625E-2,2.4992966460258453E-4,2.4992966460258453E-4,3,0.27977782208831942,0.27977782208831942,7.5525193729633459E-4,"0.0007552519373"]
[null,"17063","ARNDELL PARK","Urban",1,0,2.0392999999999999,0.84211294127525105,0,0,0,0,0,0,0,0,0,0,0,"0"]
[null,"17067","ARNDELL PARK","Urban",1246,2.2160423443057198,4.9061679131139497,3.2962082723274713,3.7649713112099997E-2,0,3,3.6273944764700001E-3,3.6273944764178387E-3,3.2777660931486496E-5,3.2777660931486496E-5,0,0,0,0,"0"]
[null,"17068","ARNDELL PARK","Urban",30,0,1.00648,1.3654333866334656,0,0,0,0,0,0,0,0,0,0,0,"0"]
[null,"17069","ARNDELL PARK","Urban",21,0.75994000000000006,2.5550000000000002,1.4479944751275813,9.4691296532000008E-2,2.1050385531566192E-2,3,9.1231156258999996E-3,9.1231156259304075E-3,6.1458114246537178E-5,6.1458114246537178E-5,2,2.0281177701357267E-3,2.0281177701357267E-3,4.097207616435812E-6,"4.0972076164e-06"]
[null,"17070","ARNDELL PARK","Short rural",3,0.48694999999999999,1.7003499999999998,0.15877132402714703,0,1.3820960197492954E-2,0,0,0,0,0,1,3.4463256866141176E-3,3.4463256866141176E-3,1.0604079035735746E-5,"1.0604079036e-05"]
[null,"1949","MARAYONG","Urban",2,0,0.96425003587189406,5.0728581180206493,0,0,0,0,0,0,0,0,0,0,0,"0"]
[null,"1950","MARAYONG","Urban",362,3.5863578865574701,2.4569161799934398,3.535405528083218,0.448677981718,0.27060731299501589,2,4.3228271824999998E-2,4.3228271825142106E-2,5.0259080094945967E-4,5.0259080094945967E-4,4,2.6071897799253216E-2,2.6071897799253216E-2,7.5115472967989889E-5,"7.5115472968e-05"]
[null,"1951","MARAYONG","Urban",1,0,2.9793499999999997,2.9258227171251656,0,0,0,0,0,0,0,0,0,0,0,"0"]
[null,"1952","MARAYONG","Urban",357,1.44318227342571,3.57289973113323,1.6004149461936426,0.16293140154999999,0.69104800987464765,1,1.5697768114000001E-2,1.5697768114437741E-2,5.831692174060306E-4,5.831692174060306E-4,2,6.6579623767081944E-2,6.6579623767081944E-2,1.6115683291314194E-4,"0.00016115683291"]
[null,"1953","MARAYONG","Urban",23,1.51522717243575,2.8021702052175503,1.323047793971178,2.2496270597999999E-2,0,1,2.1674228291E-3,2.1674228290945443E-3,3.1411925059341222E-5,3.1411925059341222E-5,0,0,0,0,"0"]
[null,"1954","MARAYONG","Urban",368,0.46711594702777803,5.1143044327232303,4.9333730642657212,2.8832649274000002E-2,0.17180516676268165,1,2.7779067638999998E-3,2.7779067639434802E-3,2.458324569861487E-5,2.458324569861487E-5,2,1.6552718770400678E-2,1.6552718770400678E-2,3.9606340292212845E-5,"3.9606340292e-05"]
[null,"1956","MARAYONG","Urban",138,0,1.8378652793049801,1.2257146214895749,0,1.3466576602685442E-2,0,0,0,0,0,1,1.297449078538007E-3,1.297449078538007E-3,2.7314717442905412E-6,"2.7314717443e-06"]
[null,"1957","MARAYONG","Urban",1554,10.143994804942199,0.95367999999999997,3.9379098870509184,3.0279951874660003,1.4282367637932334,5,0.2917348396444,0.29173483964895125,2.2684872836332944E-3,2.2684872836332944E-3,4,0.13760471779799674,0.13760471779799674,3.851375159449663E-4,"0.00038513751594"]
[null,"1958","MARAYONG","Urban",154,2.28181483683053,1.62198,4.5272817435456112,0.39791607559360997,2.8917701336292949E-2,6,3.8337571667395001E-2,3.8337571666989895E-2,5.0395653682160492E-4,5.0395653682160492E-4,4,2.7861011791763522E-3,2.7861011791763522E-3,6.8286793607263528E-6,"6.8286793607e-06"]
[null,"1959","MARAYONG","Urban",890,5.1585059320819102,1.82227862574405,4.9840604919187399,7.3555858937999999E-2,2.2964056943526753E-2,2,7.0868034405000002E-3,7.0868034405618093E-3,1.0516166215518583E-4,1.0516166215518583E-4,1,2.2124921128753383E-3,2.2124921128753383E-3,8.194415232871624E-6,"8.1944152329e-06"]
[null,"1960","MARAYONG","Urban",801,0.33994999999999997,6.6734112766112803,4.0379942490352514,1.9211276427900001,0,2,0.18509271980800002,0.18509271980835995,2.3750146816606255E-3,2.3750146816606255E-3,0,0,0,0,"0"]
[null,"1962","MARAYONG","Urban",1947,7.64248557273228,3.7944800000000001,5.7475473331945679,3.2931733437717998,1.0890916635624448,3,0.31728366060507002,0.31728366060917285,3.0742714481990043E-3,3.0742714481990043E-3,3,0.10492948705692114,0.10492948705692114,2.1442053192680748E-4,"0.00021442053193"]
[null,"1963","MARAYONG","Urban",0,0,2.1025800000000001,4.4460162290555436,7.9948938989000008E-3,0,1,7.7027503189000003E-4,7.702750318899326E-4,1.3657358721452706E-6,1.3657358721452706E-6,0,0,0,0,"0"]
[null,"19815","WEST CASTLE HILL","Urban",0,0,0,0,0,6.9459184582272284E-3,0,0,0,0,0,1,6.6921057735118254E-4,6.6921057735118254E-4,2.7314717442905412E-6,"2.7314717443e-06"]
[null,"19816","WEST CASTLE HILL","Urban",962,1.79690090864673,11.826932162528001,4.801244838580927,4.9486125179000001E-2,0.74888341254723356,1,4.7677839297000004E-3,4.7677839296591399E-3,2.5948981570760141E-5,2.5948981570760141E-5,2,7.2151826125434651E-2,7.2151826125434651E-2,1.024301904108953E-4,"0.00010243019041"]
[null,"19856","SPRINGWOOD","Urban",1118,9.7155051808091706,3.9629042539214496,4.6488243675148668,4.1057770981947996,-0.2104329785967004,11,0.39557467869617002,0.39557467869605023,3.8965387973016645E-3,3.8965387973016645E-3,7,-2.0274349021996541E-2,-2.0274349021996541E-2,8.699737505565374E-4,"0.00086997375056"]
[null,"19857","SPRINGWOOD","Urban",2455,21.6847829280767,3.4857551385575296,8.7641770862985187,10.431580467348699,6.7544662649684177,14,1.0050397264513999,1.0050397264469173,1.6448359449437285E-2,1.6448359449437285E-2,15,0.65076494866198853,0.65076494866198853,1.6621005564007943E-3,"0.0016621005564"]
[null,"19868","LENNOX","Urban",1543,0.77403409597401396,3.55501314412522,1.5624724102629304,2.4218716623000001,0,1,0.23333733948999999,0.23333733949189162,2.1237192811858958E-3,2.1237192811858958E-3,0,0,0,0,"0"]
[null,"19870","LENNOX","Urban",1630,0.38130220754112498,3.2965733035981102,2.644220816148243,7.2294253341000005E-4,4.3660058880285436E-2,1,6.9652529478999995E-5,6.9652529479408807E-5,1.3657358721452706E-6,1.3657358721452706E-6,2,4.2064664862074335E-3,4.2064664862074335E-3,3.8240604420067578E-5,"3.824060442e-05"]
[null,"19871","LENNOX","Urban",1460,0.19869000000000001,3.2975879633818197,2.0890038468782768,0,0,0,0,0,0,0,0,0,0,0,"0"]
[null,"25449","KEMBLA GRANGE","Short rural",418,17.588373498676198,6.0989499999999994,1.3934196903770828,4.5800535793099999E-2,1.7444178070804952,2,1.14205931218E-2,1.1420593121487398E-2,6.0089781202502569E-5,6.0089781202502569E-5,20,0.4349793220458803,0.4349793220458803,1.1311017638118129E-3,"0.0011311017638"]
[null,"25450","KEMBLA GRANGE","Short rural",1112,16.536266232131002,0.44527887933202404,2.4264494330273183,7.275410149310531,6.9062983723277487,10,1.81415998019793,1.8141599802057189,1.4361457707398112E-2,1.4361457707398112E-2,17,1.7221201088685447,1.7221201088685447,4.3618111766993038E-3,"0.0043618111767"]
[null,"25451","KEMBLA GRANGE","Short rural",29,3.3321399999999999,1.28317544175118,1.1633435296440471,3.2291433159000002E-2,0.17761705771752484,1,8.0520306810999993E-3,8.0520306811353443E-3,6.0089781202502562E-5,6.0089781202502562E-5,3,4.4289703439256298E-2,4.4289703439256298E-2,1.343183344526528E-4,"0.00013431833445"]
[null,"25737","PRESTONS","Urban",494,0,5.5794799999999993,2.5601558456729352,0,0,0,0,0,0,0,0,0,0,0,"0"]
[null,"25738","PRESTONS","Urban",962,1.26651812903675,6.7604406837387492,3.0642440030090996,4.4170371257300001E-2,1.5309371295684503E-2,3,4.2556329776200002E-3,4.2556329776046627E-3,3.0046189187195955E-5,3.0046189187195955E-5,1,1.4749947419168922E-3,1.4749947419168922E-3,2.7314717442905412E-6,"2.7314717443e-06"]
[null,"25739","PRESTONS","Short rural",753,0.47868315793538802,10.9595,2.8053832363152322,1.4175343792000001E-4,9.4974803408413119E-2,1,3.5346930118999998E-5,3.5346930119119152E-5,7.0693860238238313E-6,7.0693860238238313E-6,3,2.3682443179809835E-2,2.3682443179809835E-2,4.2416316142942983E-5,"4.2416316143e-05"]
[null,"25740","PRESTONS","Urban",578,0,5.1656188327059596,2.6292531258895555,0,0,0,0,0,0,0,0,0,0,0,"0"]
[null,"25741","PRESTONS","Urban",221,1.3186,3.4859499999999999,0.87006685566876674,4.0442255838999998E-2,0.11652132597270982,1,3.8964444431999999E-3,3.8964444432304569E-3,5.4629434885810824E-6,5.4629434885810824E-6,3,1.1226348869034125E-2,1.1226348869034125E-2,2.7314717442905411E-5,"2.7314717443e-05"]
[null,"25744","PRESTONS","Short rural",766,8.5396099999999997,13.802010000000001,4.2499704788291979,3.2879568172580997,0.44085319194054445,5,0.81986850942031997,0.81986850941995693,1.0985825881022234E-2,1.0985825881022234E-2,7,0.10992895267046057,0.10992895267046057,2.262203527623626E-4,"0.00022622035276"]
[null,"25746","PRESTONS","Urban",704,1.01966607536081,4.1014896524775102,2.6755889490936382,0,0.15755894625141967,0,0,0,0,0,1,1.5180154218894683E-2,1.5180154218894683E-2,2.5948981570760141E-5,"2.5948981571e-05"]
[null,"25747","PRESTONS","Short rural",605,0.99069392193903405,8.8435029550063504,3.8367280976748925,0,0.32617466066083373,0,0,0,0,0,1,8.1333286204093178E-2,8.1333286204093178E-2,2.0854688770280302E-4,"0.0002085468877"]
[null,"25773","PARKLEA","Urban",1585,0,8.2319800000000001,7.6705602063995304,5.0124015649999999E-2,0.82252432354823446,1,4.8292420439E-3,4.8292420439056769E-3,1.7754566337888518E-5,1.7754566337888518E-5,4,7.9246823981229328E-2,7.9246823981229328E-2,3.578227985020609E-4,"0.0003578227985"]
[null,"25774","PARKLEA","Urban",1731,0.22036,11.967608552630999,7.5371313260283017,1.3055491633E-2,0.13268121789593235,1,1.2578427381999999E-3,1.2578427382457943E-3,1.9120302210033789E-5,1.9120302210033789E-5,1,1.2783287763279732E-2,1.2783287763279732E-2,5.3263699013665555E-5,"5.3263699014e-05"]
[null,"25775","PARKLEA","Urban",1067,0.46929132109773597,9.7568509772677814,9.2972422804402122,0,1.7860933178298587E-2,0,0,0,0,0,2,1.720827198903041E-3,1.720827198903041E-3,4.097207616435812E-6,"4.0972076164e-06"]
[null,"25776","PARKLEA","Urban",2,0,3.0690300000000001,3.4822590501636612,0,0,0,0,0,0,0,0,0,0,0,"0"]
[null,"25777","PARKLEA","Urban",1295,0.885905955253252,14.642340000000001,10.745643210157313,2.7330062831999999E-2,0.10234598218040936,1,2.6331387614999999E-3,2.6331387614960816E-3,2.5948981570760141E-5,2.5948981570760141E-5,3,9.860612996888854E-3,9.860612996888854E-3,1.5705962529670613E-4,"0.0001570596253"]
[null,"25779","PARKLEA","Urban",759,0,9.5336799999999986,4.4043419319249049,0,8.9304665891492933E-3,0,0,0,0,0,1,8.6041359945152052E-4,8.6041359945152052E-4,1.3657358721452706E-6,"1.3657358721e-06"]
[null,"25780","PARKLEA","Urban",1667,0.53885068427704008,12.431062004001999,7.6356559185254014,9.5074030814600002E-2,0.44992541196761676,2,9.1599904944699995E-3,9.1599904944783296E-3,1.7754566337888518E-5,1.7754566337888518E-5,2,4.334845658189089E-2,4.334845658189089E-2,1.3793932308667233E-4,"0.00013793932309"]
[null,"25781","PARKLEA","Urban",1894,1.3850451700436299,16.356711120714898,7.8729441078810458,2.3267409300497,0.22879004880772952,6,0.22417188605774999,0.22417188605392474,2.7191801214412345E-3,2.7191801214412345E-3,3,2.2042976976424666E-2,2.2042976976424666E-2,1.6388830465743247E-4,"0.00016388830466"]
[null,"25782","PARKLEA","Urban",1066,0,12.87196,9.3738589705627628,0,0.43986091787508347,0,0,0,0,0,4,4.2378784112667746E-2,4.2378784112667746E-2,1.352078513423818E-4,"0.00013520785134"]
[null,"25783","PARKLEA","Urban",2653,5.0735948485022702,19.2136186377749,7.154896349371187,8.8269865794999999E-2,1.6142881510671769,1,8.5044372757999993E-3,8.5044372758485993E-3,6.1458114246537178E-5,6.1458114246537178E-5,5,0.15553000111990342,0.15553000111990342,2.7314717442905411E-4,"0.00027314717443"]
[null,"25784","PARKLEA","Urban",1912,0,17.598509999999997,7.4202921437620297,0,1.2095820857969988,0,0,0,0,0,6,0.11653824197015594,0.11653824197015594,4.2474385623717914E-4,"0.00042474385624"]
[null,"27027","NARELLAN","Urban",758,0,5.2998199999999995,3.4485131578696349,4.3131195938000001E-2,0,1,4.1555127243000003E-3,4.1555127243283231E-3,1.0388781810820808E-3,1.0388781810820808E-3,0,0,0,0,"0"]
[null,"27029","NARELLAN","Short rural",1451,1.94418,27.428074294602201,6.8906754627781899,0.32901237547900003,0.80480514380785895,2,8.2040884616000009E-2,8.2040884615794854E-2,5.8165023034308823E-3,5.8165023034308823E-3,5,0.200682195751299,0.200682195751299,3.3933052914354386E-4,"0.00033933052914"]
[null,"27030","NARELLAN","Urban",1624,0,10.843175984646299,7.2653757874822436,9.1781819323999994E-2,0.10085757108221781,1,8.8427995044999992E-3,8.8427995044559424E-3,2.2106998761139856E-3,2.2106998761139856E-3,2,9.7172107303136E-3,9.7172107303136E-3,4.9166491397229741E-5,"4.9166491397e-05"]
[null,"27031","NARELLAN","Short rural",595,16.145214871499601,11.079649999999999,3.2008298923872851,2.9845794220295998,0.25947966811806,9,0.74421983557399995,0.74421983558501625,1.2497613018552017E-2,1.2497613018552017E-2,6,6.4702555583047619E-2,6.4702555583047619E-2,1.5199179951221238E-4,"0.00015199179951"]
[null,"27033","NARELLAN","Urban",795,0,10.44699,4.3058783076162293,5.6322263213999996E-2,5.1598251403973693E-2,2,5.4264176163999998E-3,5.4264176163144199E-3,1.1032603997956573E-3,1.1032603997956573E-3,1,4.971278574608785E-3,4.971278574608785E-3,1.9120302210033789E-5,"1.912030221e-05"]
[null,"27035","NARELLAN","Urban",515,0,9.1409900000000004,1.7909405350262191,3.0726709506999999E-2,0,1,2.9603916505999998E-3,2.9603916505885884E-3,7.4009791264714709E-4,7.4009791264714709E-4,0,0,0,0,"0"]
[null,"27036","NARELLAN","Short rural",0,0,0,0,0,0.45502853573284496,0,0,0,0,0,3,0.11346364568237248,0.11346364568237248,2.5449789685765792E-4,"0.00025449789686"]
[null,"27038","NARELLAN","Short rural",592,0.66055999999999993,18.906569999999999,4.7440871619311542,6.1074361729999999E-2,7.1585486151117345E-2,3,1.5229198161100001E-2,1.522919816117773E-2,2.4155141668541161E-3,2.4155141668541161E-3,2,1.7850199710155171E-2,1.7850199710155171E-2,3.5346930119119152E-5,"3.5346930119e-05"]
[null,"27039","NARELLAN","Urban",1164,0,7.4285928822412597,3.4104080401031194,0.15134249332700001,0.18583875711705911,2,1.45812246353E-2,1.4581224635249938E-2,1.6649891442018423E-3,1.6649891442018423E-3,1,1.7904797283824499E-2,1.7904797283824499E-2,3.1411925059341222E-5,"3.1411925059e-05"]
[null,"27040","NARELLAN","Urban",1264,0,15.2577787563638,5.4680843994949457,0.16053513426740001,1.0784601557182194,7,1.546689765132E-2,1.5466897651321901E-2,1.769295547183376E-3,1.769295547183376E-3,7,0.10390518515281219,0.10390518515281219,2.4036951349756762E-4,"0.0002403695135"]
[null,"27041","NARELLAN","Short rural",39,0,7.35283,1.467047034010839,2.1622499279000001E-3,0,1,5.3916785528000004E-4,5.3916785527639182E-4,1.3479196381909795E-4,1.3479196381909795E-4,0,0,0,0,"0"]
[null,"27042","NARELLAN","Urban",6,0,4.1058699999999995,1.9814661238587954,0,0,0,0,0,0,0,0,0,0,0,"0"]
[null,"27142","BOSSLEY PARK","Urban",649,4.5179999999999998E-2,4.4623856260623596,3.1373213627764325,8.9304665891000001E-4,4.3943565756131443E-3,1,8.6041359945000006E-5,8.6041359945152052E-5,1.3657358721452706E-6,1.3657358721452706E-6,1,4.2337812036503388E-4,4.2337812036503388E-4,1.3657358721452706E-6,"1.3657358721e-06"]
[null,"27187","WEST CASTLE HILL","Urban",609,0.93643881430514497,6.9317637371060803,4.3058783076162293,0.19859661549589999,7.9381925236882603E-2,5,1.9133964285770001E-2,1.9133964286246533E-2,8.6860801467977583E-4,8.6860801467977583E-4,1,7.6481208840135156E-3,7.6481208840135156E-3,1.9120302210033789E-5,"1.912030221e-05"]
[null,"27188","WEST CASTLE HILL","Urban",368,0.49342052635192601,1.49937414718331,3.0623812978356066,0.21886328079099998,0.16344171392522436,2,2.10865738457E-2,2.1086573845935735E-2,5.4629434885585209E-4,5.4629434885585209E-4,2,1.574693460583497E-2,1.574693460583497E-2,2.32175098264696E-5,"2.3217509826e-05"]
[null,"27189","WEST CASTLE HILL","Urban",75,0,2.6423552849774703,3.2351702245184688,1.7615435320000001E-2,1.6301645361145534E-2,1,1.6971744934E-3,1.6971744934164686E-3,1.0243019040893682E-4,1.0243019040893682E-4,1,1.5705962529670612E-3,1.5705962529670612E-3,3.1411925059341222E-5,"3.1411925059e-05"]
[null,"27190","WEST CASTLE HILL","Urban",0,0,0,0,0,4.4014442475092945E-2,0,0,0,0,0,1,4.2406098830110655E-3,4.2406098830110655E-3,1.2291622849307435E-5,"1.2291622849e-05"]
[null,"27191","WEST CASTLE HILL","Urban",1041,3.1124428219280298,7.3610773758553796,4.5916666908650932,0.44832237400410002,7.2294253340732372E-3,4,4.3194010489100002E-2,4.3194010489117016E-2,1.4490457603445041E-3,1.4490457603445041E-3,1,6.9652529479408804E-4,6.9652529479408804E-4,4.097207616435812E-6,"4.0972076164e-06"]
[null,"27194","WEST CASTLE HILL","Urban",796,0,11.561030950399099,4.6832879061935015,0.27596155334213002,0,3,2.6587756759748997E-2,2.6587756759550961E-2,2.1646913573483608E-3,2.1646913573483608E-3,0,0,0,0,"0"]
[null,"27195","WEST CASTLE HILL","Urban",0,0,0,0,0,0.12345306908714475,0,0,0,0,0,2,1.1894193710513161E-2,1.1894193710513161E-2,3.1411925059341222E-5,"3.1411925059e-05"]
[null,"27199","WEST CASTLE HILL","Short rural",26,0,2.08175,0.1905255888325765,1.5558517039900001E-2,0,2,3.8795941927899998E-3,3.8795941927659964E-3,2.6156728287530314E-4,2.6156728287530314E-4,0,0,0,0,"0"]
[null,"27200","WEST CASTLE HILL","Urban",608,0.36533102438882903,4.2573793778402393,3.917121004968088,0.11252387902300001,0.22964056943526753,2,1.0841211353100001E-2,1.0841211353068399E-2,1.6743921792475068E-3,1.6743921792475068E-3,1,2.2124921128753385E-2,2.2124921128753385E-2,6.1458114246537178E-5,"6.1458114247e-05"]
[null,"27201","WEST CASTLE HILL","Urban",559,1.2455345862790901,3.6938599999999999,3.867669453301303,0.219496617525377,0.304061124344845,4,2.1147593225916403E-2,2.114759322638448E-2,1.5446472713939929E-3,1.5446472713939929E-3,1,2.9295034457516054E-2,2.9295034457516054E-2,8.8772831689442586E-5,"8.8772831689e-05"]
[null,"27334","BOW BOWING","Short rural",1611,6.2095916897643599,6.7079846823479699,3.0674619802044814,0.25437654435629997,1.1396976409009574,4,6.3430066099499999E-2,6.3430066098759313E-2,3.5346930119119159E-4,3.5346930119119159E-4,2,0.28418931815771803,0.28418931815771803,9.8264465731151248E-4,"0.00098264465731"]
[null,"27335","BOW BOWING","Urban",509,4.1669657928460797,1.4257174878924801,4.1725103954334246,0.18698695996420001,0.71975308105405611,4,1.8015421889429999E-2,1.8015421889468263E-2,8.8772831689442586E-5,8.8772831689442586E-5,2,6.9345238908176121E-2,6.9345238908176121E-2,1.2837917198165542E-4,"0.00012837917198"]
[null,"27336","BOW BOWING","Urban",8,0.27838999999999997,1.7107075876278299,3.2579875690370579,1.15529051907E-2,1.8569700367913611E-2,2,1.1130747357999998E-3,1.1130747357983957E-3,2.185177395432433E-5,2.185177395432433E-5,2,1.7891139925103046E-3,1.7891139925103046E-3,8.194415232871624E-6,"8.1944152329e-06"]
[null,"27337","BOW BOWING","Urban",3,0,0.26024239909498698,1.4289419162443235,0,0,0,0,0,0,0,0,0,0,0,"0"]
[null,"27339","BOW BOWING","Urban",32,0,3.6357726830503503,3.6771438644687269,2.3672824133000002E-3,4.9330196397205622E-2,1,2.2807789064999999E-4,2.280778906482602E-4,1.3657358721452706E-6,1.3657358721452706E-6,2,4.7527608350655419E-3,4.7527608350655419E-3,5.4629434885810824E-6,"5.4629434886e-06"]
[null,"27340","BOW BOWING","Urban",640,0.27601082870618804,8.7481883103329192,3.3532503634533462,8.1649980244000008E-3,3.8202551520249754E-2,2,7.8666386234999995E-4,7.8666386235567585E-4,2.8680453315050682E-5,2.8680453315050682E-5,4,3.6806581754315042E-3,3.6806581754315042E-3,4.3703547908648659E-5,"4.3703547909e-05"]
[null,"27446","NORTH RICHMOND","Urban",385,1.6269800000000001,3.0031500000000002,2.781673596955617,0,0.46920387952514542,0,0,0,0,0,3,4.5205857368008459E-2,4.5205857368008459E-2,1.6525404052957775E-4,"0.00016525404053"]
[null,"27447","NORTH RICHMOND","Urban",230,0.95550000000000002,0.69540000000000002,0.76210235533030601,0.24670768336000001,0.89814978268015755,1,2.3769267119000001E-2,2.376926711881629E-2,5.1897963141520282E-5,5.1897963141520282E-5,1,8.6533024859124341E-2,8.6533024859124341E-2,1.8027713512317571E-4,"0.00018027713512"]
[null,"27454","NORTH RICHMOND","Short rural",690,28.422575903590602,5.9232200000000006,3.9629322477175908,2.0866247815600003,0.69459184582272282,2,0.52031034605000004,0.52031034604644588,2.9479339719345374E-3,2.9479339719345374E-3,5,0.17319995758368387,0.17319995758368387,4.4537131950090134E-4,"0.0004453713195"]
[null,"27500","QUARRIES","Urban",2,0,2.26776,0,0,0,0,0,0,0,0,0,0,0,0,"0"]
[null,"2806","DUNDAS","Urban",863,4.4483778202433895,3.4688585276395201,3.3341978045700889,0.49086380483600001,0.31455087875114734,3,4.7292701781E-2,4.7292701780646429E-2,3.0182762774410481E-4,3.0182762774410481E-4,2,3.0305679002903554E-2,3.0305679002903554E-2,9.28700393058784E-5,"9.2870039306e-05"]
[null,"2807","DUNDAS","Urban",1317,7.4936898325194496,2.6463405191407201,3.2255753558648603,0,0.3586361979452018,0,0,0,0,0,1,3.4553117565275349E-2,3.4553117565275349E-2,7.5115472967989889E-5,"7.5115472968e-05"]
[null,"2809","DUNDAS","Urban",629,3.3682344146938399,1.6920088899508001,2.4525876385592591,0.67483141657199996,0.16840308425252953,4,6.5017221929299998E-2,6.5017221929347752E-2,9.9288997904961184E-4,9.9288997904961184E-4,1,1.6224942161085814E-2,1.6224942161085814E-2,4.5069283780793926E-5,"4.5069283781e-05"]
[null,"2810","DUNDAS","Urban",1508,7.30664767356991,1.65591895897148,3.8554688296777546,2.5690826075520006,0.7157131080732505,10,0.24752050652490001,0.24752050652412025,1.5514759507570279E-3,1.5514759507570279E-3,1,6.8956004184614714E-2,6.8956004184614714E-2,1.352078513423818E-4,"0.00013520785134"]
[null,"2812","DUNDAS","Short rural",1769,4.8772295693894101,1.5451300000000001,3.9935484396723875,2.4157337383550002,0,5,0.60237531370599995,0.60237531370400488,7.1330104980382456E-3,7.1330104980382456E-3,0,0,0,0,"0"]
[null,"2813","DUNDAS","Urban",854,6.2057288494243501,0.33431309482545801,3.0520573512620781,3.3679735345999999,0.24494994073095205,2,0.32449035030000001,0.32449035029420026,2.3354083413668382E-3,2.3354083413668382E-3,1,2.3599915870670275E-2,2.3599915870670275E-2,4.9166491397229741E-5,"4.9166491397e-05"]
[null,"2815","DUNDAS","Urban",1765,5.0944223147082903,0.82238,4.4981922966426531,7.1277254102784999,0,8,0.68672692687463011,0.68672692686436509,5.5739208000704183E-3,5.5739208000704183E-3,0,0,0,0,"0"]
[null,"2816","DUNDAS","Urban",729,5.5071791861071695,0.19943,2.0750319703638755,1.8645002426839998,0,6,0.17963690351167,0.1796369035111344,1.7891139925097174E-3,1.7891139925097174E-3,0,0,0,0,"0"]
[null,"3","INNER HARBOUR","Urban",0,0,0,0,0,2.8917701336292949E-2,0,0,0,0,0,1,2.7861011791763522E-3,2.7861011791763522E-3,5.4629434885810824E-6,"5.4629434886e-06"]
[null,"35001","QUARRIES","Urban",920,3.0263239282274998,3.8868299999999998,3.1372705559527381,0.1391451746648,0,4,1.34060633209E-2,1.3406063320977976E-2,1.4476800244739868E-4,1.4476800244739868E-4,0,0,0,0,"0"]
[null,"35004","QUARRIES","Urban",700,0,7.7585500000000005,2.9273875672947716,0,0.11482028471763377,0,0,0,0,0,1,1.1062460564376693E-2,1.1062460564376693E-2,2.0486038082179059E-5,"2.0486038082e-05"]
[null,"35005","QUARRIES","Urban",673,3.0917444240023602,2.8740378186764803,2.3310678776606446,0.60635033071599997,0.22857741865084499,2,5.8419351930900004E-2,5.8419351931013955E-2,9.4508922352452731E-4,9.4508922352452731E-4,1,2.2022490938342489E-2,2.2022490938342489E-2,5.8726642502246637E-5,"5.8726642502e-05"]
[null,"35006","QUARRIES","Urban",7,0,1.0271300000000001,0.7805452323292994,0,0,0,0,0,0,0,0,0,0,0,"0"]
[null,"35009","QUARRIES","Urban",10,0.34894999999999998,2.7641100000000001,1.7110417240933899,0,0,0,0,0,0,0,0,0,0,0,"0"]
[null,"35010","QUARRIES","Urban",650,2.5150252942239599,5.5100100000000003,2.381874701349338,2.0922807437E-2,0.44227072631977454,1,2.0158261473E-3,2.0158261472864192E-3,2.458324569861487E-5,2.458324569861487E-5,2,4.2610959210932442E-2,4.2610959210932442E-2,1.0106445453875003E-4,"0.00010106445454"]
[null,"35011","QUARRIES","Urban",69,0,1.6875599999999999,1.7083286397084139,0,0,0,0,0,0,0,0,0,0,0,"0"]
[null,"35012","QUARRIES","Urban",2,0,4.0186399999999995,1.945023659397499,0,0,0,0,0,0,0,0,0,0,0,"0"]
[null,"35013","QUARRIES","Short rural",18,0,5.57376,0.66048870795293257,0,0.11226872283501969,0,0,0,0,0,1,2.7994768654342372E-2,2.7994768654342372E-2,4.2416316142942983E-5,"4.2416316143e-05"]
[null,"35014","QUARRIES","Urban",20,0,3.1653000000000002,2.6666952146069338,0,0,0,0,0,0,0,0,0,0,0,"0"]
[null,"35015","QUARRIES","Urban",16,0,2.1078099999999997,1.7595419179866105,0,0,0,0,0,0,0,0,0,0,0,"0"]
[null,"35304","BAULKHAM HILLS 11KV","Urban",1069,6.1411842012930897,1.34371376751358,4.2238760941826881,1.3426460379680001,0,4,0.1293584046066,0.12935840460198358,1.6211284802364362E-3,1.6211284802364362E-3,0,0,0,0,"0"]
[null,"35305","BAULKHAM HILLS 11KV","Urban",1109,6.1007820279494798,0.28898000000000001,3.4294605989863767,0.80963768663000002,0.55794153166494631,2,7.8005249697799997E-2,7.800524969745086E-2,1.5378185920344482E-3,1.5378185920344482E-3,1,5.3755363927637849E-2,5.3755363927637849E-2,1.1199034151591219E-4,"0.00011199034152"]
[null,"35306","BAULKHAM HILLS 11KV","Urban",491,2.4408709310202799,1.9735595666966401,2.438117855172715,0.51725829497999998,1.4175343792300465E-2,1,4.9835701975E-2,4.9835701974580926E-2,6.705763132233279E-4,6.705763132233279E-4,1,1.3657358721452706E-3,1.3657358721452706E-3,6.8286793607263528E-6,"6.8286793607e-06"]
[null,"35307","BAULKHAM HILLS 11KV","Urban",520,3.95600963883685,0.675550063100266,2.438117855172715,5.5113736663999997E-2,2.9059454774215954E-3,1,5.3099810709000004E-3,5.3099810709008122E-3,6.5555321862972992E-5,6.5555321862972992E-5,1,2.7997585378978048E-4,2.7997585378978048E-4,1.3657358721452706E-6,"1.3657358721e-06"]
[null,"35312","BAULKHAM HILLS 11KV","Urban",104,1.1601811672600499,0.86782999999999999,1.3288118281186585,0,0,0,0,0,0,0,0,0,0,0,"0"]
[null,"35314","BAULKHAM HILLS 11KV","Urban",426,3.09413011818947,1.43116,2.6292531258895555,0.48468460435799998,1.6627678268368445E-2,4,4.6697361315799997E-2,4.6697361316284117E-2,7.293029557245939E-4,7.293029557245939E-4,3,1.6020081780264025E-3,1.6020081780264025E-3,4.097207616435812E-6,"4.0972076164e-06"]
[null,"35315","BAULKHAM HILLS 11KV","Urban",1346,3.550432784526,1.8324351561257599,3.6203418355847807,0.21411856798000001,0,1,2.0629440349000001E-2,2.0629440348754313E-2,4.3703547908648659E-5,4.3703547908648659E-5,0,0,0,0,"0"]
[null,"35325","BAULKHAM HILLS 11KV","Urban",833,6.2115299485572999,2.5659588875732102,3.7517181202789751,0.37699326816000001,8.4201542126264767E-2,1,3.6321745519999997E-2,3.632174551970347E-2,1.0379592628304056E-4,1.0379592628304056E-4,1,8.112471080542907E-3,8.112471080542907E-3,9.0138567561587853E-5,"9.0138567562e-05"]
[null,"35326","BAULKHAM HILLS 11KV","Urban",484,4.2140185378563197,3.1510767022611601,3.3453956285110689,3.9875242087499999E-2,0,4,3.8418150083899998E-3,3.8418150083446463E-3,6.2823850118682445E-5,6.2823850118682445E-5,0,0,0,0,"0"]
[null,"35327","BAULKHAM HILLS 11KV","Urban",1395,6.4540851863270099,0.76313632589070202,3.9312287897358504,0.191154511039,0.33680616850505907,3,1.84169482359E-2,1.8416948235878975E-2,2.9363321251123318E-4,2.9363321251123318E-4,1,3.2449884322171628E-2,3.2449884322171628E-2,7.3749737095844608E-5,"7.3749737096e-05"]
[null,"35333","BAULKHAM HILLS 11KV","Urban",1014,4.1517814053415796,1.01387,4.0771155032755528,0.30444385863000001,0.90027608424900252,1,2.9331909326000001E-2,2.9331909326063978E-2,1.3507127775516726E-3,1.3507127775516726E-3,3,8.6737885239946133E-2,8.6737885239946133E-2,1.8164287099532099E-4,"0.000181642871"]
[null,"35335","BAULKHAM HILLS 11KV","Urban",629,2.8461550357460599,1.3402025388559999,3.2709433090776732,0.84967010691,0.28634194460446938,1,8.1862208175999998E-2,8.1862208176387521E-2,9.0275141148802392E-4,9.0275141148802392E-4,2,2.7587864617334465E-2,2.7587864617334465E-2,8.6041359945152052E-5,"8.6041359945e-05"]
[null,"35335 / 55879","BAULKHAM HILLS /JASPER RD","Urban",0,0,0,0,0,1.4990426060357742,0,0,0,0,0,1,0.14442656847936236,0.14442656847936236,3.2094792995413857E-4,"0.00032094792995"]
[null,"35382","NORTH PARRAMATTA","Urban",791,0.463108549002683,2.0632700000000002,2.760197552582409,0,1.4611944381103319,0,0,0,0,0,2,0.14078005370073449,0.14078005370073449,2.5675834396331085E-4,"0.00025675834396"]
[null,"35384","NORTH PARRAMATTA","Urban",4,0,1.2502599999999999,0.58296257568636423,0,0,0,0,0,0,0,0,0,0,0,"0"]
[null,"35388","NORTH PARRAMATTA","Urban",1569,1.8767908773978499,4.5894667034847396,3.1406238063161909,0.29436518918999999,0.36487334921381398,1,2.8360871121000001E-2,2.8360871120968689E-2,9.5601511050168948E-5,9.5601511050168948E-5,1,3.5154041349019262E-2,3.5154041349019262E-2,1.9530022971677368E-4,"0.00019530022972"]
[null,"35401","NORTH PARRAMATTA","Urban",1,0,1.4480299999999999,0.50374965687333217,0,0,0,0,0,0,0,0,0,0,0,"0"]
[null,"35403","NORTH PARRAMATTA","Urban",1588,0.38702719250337997,6.4960326929789503,3.7152489822352415,0.81413252002000003,0.3904740201027086,2,7.8438308345000013E-2,7.8438308344919327E-2,2.2944362652040549E-3,2.2944362652040549E-3,4,3.7620560334113623E-2,3.7620560334113623E-2,1.1881902087663854E-4,"0.00011881902088"]
[null,"35405","NORTH PARRAMATTA","Urban",349,0,1.4539600000000001,3.1409362682818762,0,0.27684446426362808,0,0,0,0,0,2,2.6672821582997136E-2,2.6672821582997136E-2,8.057841645657097E-5,"8.0578416457e-05"]
[null,"35418","WISEMANS","Short rural",358,44.415060680707207,0.46059,1.143153532995459,0.69216786203299996,0.86780037162084223,4,0.17259552507949999,0.17259552507864692,1.3962037397052067E-3,1.3962037397052067E-3,8,0.21639037149623555,0.21639037149623555,5.7968965395355416E-4,"0.00057968965395"]
[null,"35440","HOMEPRIDE","Urban",5,0,3.0399000000000003,3.127032980979473,0,0,0,0,0,0,0,0,0,0,0,"0"]
[null,"35441","HOMEPRIDE","Urban",12,0,1.5845100000000001,2.9344325684845103,0,0,0,0,0,0,0,0,0,0,0,"0"]
[null,"35442","HOMEPRIDE","Urban",707,0,5.5901811878298906,4.008658389037409,0,0,0,0,0,0,0,0,0,0,0,"0"]
[null,"35443","HOMEPRIDE","Urban",560,0,3.5434341366029098,3.5667234892902084,0,0,0,0,0,0,0,0,0,0,0,"0"]
[null,"35444","HOMEPRIDE","Urban",41,1.0530395247489099,2.2179230103446899,3.0992162450099174,0,0,0,0,0,0,0,0,0,0,0,"0"]
[null,"35570","LIVERPOOL 11KV","Urban",600,0,0,0,0.47708537067000001,0,1,4.5965206512999998E-2,4.5965206512921228E-2,8.2080725915930762E-4,8.2080725915930762E-4,0,0,0,0,"0"]
[null,"35571","LIVERPOOL 11KV","Urban",1907,0,0,0,4.8933286770699996E-2,0,2,4.7145202306699994E-3,4.7145202306454748E-3,3.8240604420067578E-5,3.8240604420067578E-5,0,0,0,0,"0"]
[null,"35572","LIVERPOOL 11KV","Urban",1570,0,0,0,0,0,0,0,0,0,0,0,0,0,0,"0"]
[null,"35590","KEMBLA GRANGE","Urban",3,0,0.59577999999999998,0,0,0,0,0,0,0,0,0,0,0,0,"0"]
[null,"35693","SPRINGWOOD","Short rural",947,18.220166605696502,1.4809400000000001,1.6766251817266731,2.3301497875109001,7.8416584324626948,7,0.58103452665695998,0.58103452666034316,4.2429003885818455E-3,4.2429003885818455E-3,9,1.9553568272595525,1.9553568272595525,4.6481213106641687E-3,"0.0046481213107"]
[null,"35694","SPRINGWOOD","Urban",241,7.1969849498806096E-2,0.95210000000000006,1.085995856345686,0,0,0,0,0,0,0,0,0,0,0,"0"]
[null,"35695","SPRINGWOOD","Short rural",550,14.326082775197699,1.4481254640272001,2.7245159203058438,3.0363586403301999,1.2677009953454306,8,0.75713124315380009,0.75713124315153224,6.7830758898589673E-3,6.7830758898589673E-3,6,0.3161075960552826,0.3161075960552826,7.8823654165635713E-4,"0.00078823654166"]
[null,"35696","SPRINGWOOD","Urban",1387,13.3095695706687,1.8630276967770201,3.5818810700524382,2.4786297387972005,2.3942155665195486,9,0.23880574592449,0.23880574592396131,3.8472779518332273E-3,3.8472779518332273E-3,7,0.2306727888053362,0.2306727888053362,7.1701133287626706E-4,"0.00071701133288"]
[null,"35701","SPRINGWOOD","Short rural",1069,10.3833275556948,2.5470274360541598,2.4768326548234945,2.2038055737340003,4.7016780290302185,4,0.54952996381289998,0.549529963812741,4.5372770530009727E-3,4.5372770530009727E-3,4,1.1723869781909442,1.1723869781909442,2.516701424481284E-3,"0.0025167014245"]
[null,"35702","SPRINGWOOD","Short rural",866,7.2627115457165301,1.42902672694213,2.8007261558388743,0.64323457525960004,3.140405663746245,6,0.16039376480279999,0.16039376480152701,1.085150754656958E-3,1.085150754656958E-3,8,0.7830758898589657,0.7830758898589657,1.8451097522180198E-3,"0.0018451097522"]
[null,"35703","SPRINGWOOD","Urban",189,0.20900906954922499,0.68098000000000003,1.028838179695913,0,7.6546856478422517E-3,0,0,0,0,0,1,7.3749737095844608E-4,7.3749737095844608E-4,1.3657358721452706E-6,"1.3657358721e-06"]
[null,"35761","WERRINGTON","Urban",166,1.75723007876154,2.4803299999999999,2.4768326548234945,0.25100281252750001,3.6147126670366188E-2,2,2.4183085088570002E-2,2.4183085088076307E-2,2.3217509826469599E-4,2.3217509826469599E-4,2,3.4826264739704401E-3,3.4826264739704401E-3,6.8286793607263528E-6,"6.8286793607e-06"]
[null,"35762","WERRINGTON","Urban",877,2.3828908980478398,3.9055198373231299,3.6580913055854687,4.6984556981888002,1.3565804009231546,4,0.45267681579611002,0.45267681579860869,2.9487927114564905E-3,2.9487927114564905E-3,3,0.13070092296430239,0.13070092296430239,2.6495275919618248E-4,"0.0002649527592"]
[null,"35763","WERRINGTON","Urban",238,4.5961158643381896,1.0197799999999999,4.4201936609157748,4.7629155141999998E-3,1.7931809897260089E-2,1,4.5888725303999998E-4,4.5888725304081091E-4,5.4629434885810824E-6,5.4629434885810824E-6,2,1.7276558782637673E-3,1.7276558782637673E-3,1.0925886977162165E-5,"1.0925886977e-05"]
[null,"35764","WERRINGTON","Urban",132,1.8516101807597298,2.2591018786516903,1.9624135649755379,0,0,0,0,0,0,0,0,0,0,0,"0"]
[null,"35765","WERRINGTON","Urban",1118,6.6009533083154501,0.2475,3.2579875690370579,4.7430700329E-2,3.550923619971267E-2,1,4.5697522282000004E-3,4.5697522281980757E-3,8.194415232871624E-6,8.194415232871624E-6,2,3.421168359723903E-3,3.421168359723903E-3,9.5601511050168944E-6,"9.560151105e-06"]
[null,"35766","WERRINGTON","Urban",383,2.2668713413230699,0.18557408842255299,1.2574688862950048,0.1354060022702,0.65142792397516791,2,1.304580949187E-2,1.3045809492254486E-2,2.2758801819896586E-4,2.2758801819896586E-4,1,6.276239200443591E-2,6.276239200443591E-2,1.3793932308667233E-4,"0.00013793932309"]
[null,"35767","WERRINGTON","Urban",568,2.8016430947299602,2.5977391330569,4.1915629543166828,2.4632517856096001,0.50017700571132195,5,0.23732414359978002,0.23732414360143461,1.4838045664760423E-3,1.4838045664760423E-3,5,4.818999024864587E-2,4.818999024864587E-2,1.1199034151591219E-4,"0.00011199034152"]
[null,"35768","WERRINGTON","Short rural",607,0,7.3692500000000001,2.0576763593918259,0,0,0,0,0,0,0,0,0,0,0,"0"]
[null,"35769","WERRINGTON","Urban",86,3.8112468048429702,1.2188133205782301,1.9243084472090226,8.2287870713999997E-2,0.22234026738223281,2,7.9280967378000007E-3,7.9280967378032967E-3,2.1578626779895276E-4,2.1578626779895276E-4,4,2.1421567154598569E-2,2.1421567154598569E-2,5.8726642502246637E-5,"5.8726642502e-05"]
[null,"35771","WERRINGTON","Urban",135,3.4139047323437399,0.98705540168407002,4.2677731898497138,0.18256425270000001,0,1,1.7589312297E-2,1.7589312297358939E-2,1.9530022971677368E-4,1.9530022971677368E-4,0,0,0,0,"0"]
[null,"35772","WERRINGTON","Urban",1017,0,10.23025,3.5247233934026654,9.1530194866999995E-2,0,1,8.8185565263999999E-3,8.8185565264420115E-3,4.5069283780793926E-5,4.5069283780793926E-5,0,0,0,0,"0"]
[null,"35773","WERRINGTON","Urban",382,3.5104779759496099,1.5724500000000001,3.1436722157375119,1.3212148863388999,0.11765535347609386,5,0.12729360158800002,0.12729360158865954,8.696568977073773E-4,8.696568977073773E-4,3,1.1335607738805747E-2,1.1335607738805747E-2,2.185177395432433E-5,"2.1851773954e-05"]
[null,"35815","TAHMOOR","Short rural",513,16.7236869164892,0.40187914509727396,2.1910442715746297,0,5.4858580476202803E-2,0,0,0,0,0,2,1.3679261956099113E-2,1.3679261956099113E-2,3.181223710720724E-5,"3.1812237107e-05"]
[null,"35816","TAHMOOR","Short rural",1090,34.020436570495804,7.1160000000000001E-2,2.4006224192904635,0.81060285942120003,2.0281514884271816,13,0.20212788519263,0.20212788519317099,4.3865540277826867E-3,4.3865540277826867E-3,13,0.5057297373723092,0.5057297373723092,1.4704322929553568E-3,"0.001470432293"]
[null,"35818","TAHMOOR","Short rural",1436,24.3430130987993,2.7968999999999999,4.2868257487329711,4.5205596613377006,1.004181354246565,9,1.1272242055753898,1.1272242055777457,1.4640698455339151E-2,1.4640698455339151E-2,7,0.25039765296384009,0.25039765296384009,6.7159167226326397E-4,"0.00067159167226"]
[null,"35824","TAHMOOR","Short rural",1245,13.449903756527799,2.1553,2.553042890356525,2.8170235458504997,1.8832652995260784,8,0.70243893817039993,0.70243893817821912,5.4257537732847905E-3,5.4257537732847905E-3,3,0.4696016400975575,0.4696016400975575,1.0073875083948958E-3,"0.0010073875084"]
[null,"35825","TAHMOOR","Short rural",1137,27.841889430139201,1.2549300000000001,2.9531466269049358,0.39041731872780006,2.6728319487572141,10,9.7352514933460005E-2,9.7352514934077969E-2,7.6702838358488575E-4,7.6702838358488575E-4,10,0.66648404086105117,0.66648404086105117,1.2548160192287299E-3,"0.0012548160192"]
[null,"35827","TAHMOOR","Short rural",154,8.4425129843091504,0.33097000000000004,1.8671507705592498,1.9987234747499997E-3,0.35699185806529493,2,4.9839171468000001E-4,4.9839171467957999E-4,2.1208158071471491E-5,2.1208158071471491E-5,2,8.9017708811989685E-2,8.9017708811989685E-2,1.9794280866706725E-4,"0.00019794280867"]
[null,"35980","MALDON","Short rural",454,30.772840033798701,6.2259999999999996E-2,1.4479944751275813,4.6353374200999997E-3,0.53506252678417332,1,1.1558446148999999E-3,1.1558446148951964E-3,3.181223710720724E-5,3.181223710720724E-5,5,0.13342052242762717,0.13342052242762717,3.8174684528648688E-4,"0.00038174684529"]
[null,"35981","MALDON","Short rural",448,12.3120193930498,1.3374699999999999,1.975115270897716,0.32832931292010004,1.123254242101889,4,8.1870559542099999E-2,8.1870559541903795E-2,3.4639991516736767E-4,3.4639991516736767E-4,7,0.28008907426390017,0.28008907426390017,7.4935491852532604E-4,"0.00074935491853"]
[null,"35982","MALDON","Short rural",455,38.3509112299135,1.4043556863942499,1.9052558883257651,0.22231191669045999,0.11524554503140279,7,5.5434590506023992E-2,5.5434590505814563E-2,1.0250609734544554E-3,1.0250609734544554E-3,3,2.8737054186843872E-2,2.8737054186843872E-2,7.7763246262062141E-5,"7.7763246262e-05"]
[null,"35983","MALDON","Short rural",1081,24.0266387996578,7.22120494719326,3.3723029223366039,1.7520724926999999E-2,0.8194057479139284,1,4.3688805626999998E-3,4.3688805627231271E-3,4.2416316142942983E-5,4.2416316142942983E-5,6,0.20432292955356826,0.20432292955356826,5.726202679297303E-4,"0.00057262026793"]
[null,"35988","MALDON","Short rural",708,52.912221148840402,3.4182700000000001,3.7152489822352415,1.8470472961440001,5.1031237652281675E-3,5,0.46057049945220002,0.46057049945212258,4.2380969212823865E-3,4.2380969212823865E-3,1,1.2724894842882895E-3,1.2724894842882895E-3,1.0604079035735746E-5,"1.0604079036e-05"]
[null,"35989","MALDON","Short rural",300,35.318452979410104,0.58477999999999997,1.4162402103221514,7.1840642339800004E-2,0.94450315688097997,6,1.7913824184350002E-2,1.7913824184369587E-2,7.4228553250150236E-5,7.4228553250150236E-5,7,0.23551659538369094,0.23551659538369094,5.3020395178678733E-4,"0.00053020395179"]
[null,"35990","MALDON","Short rural",1168,43.989268069997699,3.2718589716808202,3.1627247746207701,9.0594622176599998E-2,1.6933723940844214,4,2.2590223038730001E-2,2.2590223039129054E-2,1.378530274645647E-4,1.378530274645647E-4,12,0.42225089250998549,0.42225089250998549,1.1169629917641654E-3,"0.0011169629918"]
[null,"41361","PARKLEA","Urban",1615,0,10.2946854483364,6.875010448864356,0,2.3814577571064782E-2,0,0,0,0,0,1,2.2944362652040544E-3,2.2944362652040544E-3,9.5601511050168944E-6,"9.560151105e-06"]
[null,"41362","PARKLEA","Urban",455,0.53347,7.4658299999999995,2.1139868322565913,0,0,0,0,0,0,0,0,0,0,0,"0"]
[null,"41363","PARKLEA","Urban",585,0,5.0987499999999999,2.9148725764496568,0,0,0,0,0,0,0,0,0,0,0,"0"]
[null,"41367","PARKLEA","Urban",676,0,8.3408799999999985,3.700008205299226,0,0.49160092271698014,0,0,0,0,0,3,4.7363720045997981E-2,4.7363720045997981E-2,1.5296241768027031E-4,"0.00015296241768"]
[null,"41531","WERRINGTON","Urban",3,0,1.9306800000000002,4.1153527187836518,0,0,0,0,0,0,0,0,0,0,0,"0"]
[null,"41533","WERRINGTON","Short rural",952,19.816817249562799,3.2527499999999998,3.1627247746207701,1.3702170816499999,1.3138842654207457,5,0.34167049591669996,0.34167049591742954,3.3261461242091125E-3,3.3261461242091125E-3,6,0.32762362588809163,0.32762362588809163,7.7056307659679752E-4,"0.0007705630766"]
[null,"41534","WERRINGTON","Urban",317,0,3.0587499999999999,1.2765214451782625,4.6750283827E-2,0,1,4.5041969062999997E-3,4.5041969063351027E-3,1.2291622849307435E-5,1.2291622849307435E-5,0,0,0,0,"0"]
[null,"41535","WERRINGTON","Urban",1720,11.0242504663715,1.31299079777689,4.1534578365501673,0.91630839807179998,3.7524261319788179,8,8.8282532511330003E-2,8.8282532511342438E-2,3.6738294960707784E-4,3.6738294960707784E-4,7,0.36153077139493528,0.36153077139493528,8.0032122107712861E-4,"0.00080032122108"]
[null,"41537","WERRINGTON","Urban",1412,7.1931406498855299,1.8775599999999999,3.9248271299510757,2.4650781101699999,1.5232824439206081,4,0.23750010243050002,0.23750010243019043,2.1237192811858958E-3,2.1237192811858958E-3,5,0.14676197682073078,0.14676197682073078,3.7011442135136835E-4,"0.00037011442135"]
[null,"46393","NEWTON","Urban",2,0,0.42802999999999997,2.4574924023010998,0,0,0,0,0,0,0,0,0,0,0,"0"]
[null,"46395","NEWTON","Urban",927,3.3616868418286399,4.9335573694820996,2.8370955854911255,0.91921434354999998,2.4180301440906136,3,8.8562508365000001E-2,8.8562508365132214E-2,1.307009229643024E-3,1.307009229643024E-3,5,0.23296722507054027,0.23296722507054027,3.1002204297697644E-4,"0.00031002204298"]
[null,"46397","NEWTON","Urban",1385,3.11498465961043,5.4530505825057496,4.6359956445334793,0.84639560249599999,0.22453744567003939,2,8.1546723189600004E-2,8.1546723189921969E-2,2.2602928684004229E-3,2.2602928684004229E-3,2,2.1633256214781085E-2,2.1633256214781085E-2,4.0972076164358119E-5,"4.0972076164e-05"]
[null,"46401","NEWTON","Urban",20,0,1.1883800000000002,2.0552306459165051,0,6.8041650203042236E-3,0,0,0,0,0,1,6.555532186297299E-4,6.555532186297299E-4,1.3657358721452706E-6,"1.3657358721e-06"]
[null,"46746","ARNDELL PARK","Urban",166,0.60004758947913694,3.5315799999999999,2.5294329593883926,0,0.12942088882370326,0,0,0,0,0,2,1.246916851268632E-2,1.246916851268632E-2,2.8680453315050682E-5,"2.8680453315e-05"]
[null,"46748","ARNDELL PARK","Urban",12,0,0.90495999999999999,1.1484272812943448,0,0,0,0,0,0,0,0,0,0,0,"0"]
[null,"46750","ARNDELL PARK","Urban",97,0.95924493432181202,2.664815695807,2.089430624197262,2.5246287293700001E-2,0.20348706013847317,2,2.4323755882799999E-3,2.4323755882907265E-3,8.194415232871624E-6,8.194415232871624E-6,2,1.960513844464536E-2,1.960513844464536E-2,3.8240604420067578E-5,"3.824060442e-05"]
[null,"46752","ARNDELL PARK","Urban",1448,5.2970949183038005,1.79071,3.5743553092935518,0,1.7176264073130474,0,0,0,0,0,5,0.16548621562784244,0.16548621562784244,4.2064664862074332E-4,"0.00042064664862"]
[null,"46763","ARNDELL PARK","Urban",23,0,2.6867399999999999,1.2508004906858647,0,0,0,0,0,0,0,0,0,0,0,"0"]
[null,"46768","ARNDELL PARK","Urban",94,0.778575861912428,0.71109449202680697,2.2727899105485361,0,0,0,0,0,0,0,0,0,0,0,"0"]
[null,"46770","ARNDELL PARK","Short rural",7,0,3.53840418018827,3.2325841571927207,3.1611016656399996E-2,2.6366139453678866E-2,2,7.8823654165E-3,7.8823654165635706E-3,1.4138772047647663E-5,1.4138772047647663E-5,2,6.5745290021561624E-3,6.5745290021561624E-3,1.0604079035735746E-5,"1.0604079036e-05"]
[null,"46772","ARNDELL PARK","Urban",10,1.02925,1.3413599999999999,1.6817617516015995,2.3247563818999999E-2,0,1,2.2398068303000002E-3,2.2398068303182439E-3,1.3657358721452706E-5,1.3657358721452706E-5,0,0,0,0,"0"]
[null,"46774","ARNDELL PARK","Urban",764,2.7595094511123999,5.1320533193051201,3.1881281864651072,1.5976888235308999,0,2,0.15393072441209998,0.15393072441362132,3.154849864655575E-4,3.154849864655575E-4,0,0,0,0,"0"]
[null,"48157","HINCHINBROOK","Urban",8,0,3.06724,1.613455787663937,0,0,0,0,0,0,0,0,0,0,0,"0"]
[null,"48159","HINCHINBROOK","Urban",904,0,4.2714991988832995,4.1420091539172184,1.9845481309200001E-2,0,2,1.9120302210100001E-3,1.9120302210033789E-3,3.6874868547922311E-5,3.6874868547922311E-5,0,0,0,0,"0"]
[null,"48161","HINCHINBROOK","Urban",1099,0.86324016340250098,8.5274819991827293,4.1953398065726351,0.82704625821650002,0.52221966530834918,2,7.9682493724269998E-2,7.9682493724443665E-2,1.5091381387205239E-3,1.5091381387205239E-3,2,5.0313709529831767E-2,5.0313709529831767E-2,8.4675624073006771E-5,"8.4675624073e-05"]
[null,"48166","HINCHINBROOK","Urban",469,0,5.69937,2.1840164176878858,0,0,0,0,0,0,0,0,0,0,0,"0"]
[null,"48168","HINCHINBROOK","Urban",745,1.7410000000000002E-2,10.207048728723398,2.881475345983187,1.1751360004000001E-2,0,1,1.132195038E-3,1.1321950380084294E-3,2.0486038082179059E-5,2.0486038082179059E-5,0,0,0,0,"0"]
[null,"48176","HINCHINBROOK","Urban",5,0,2.4083800000000002,0.75839663262751233,0,0,0,0,0,0,0,0,0,0,0,"0"]
[null,"48178","HINCHINBROOK","Urban",896,5.7909999999999996E-2,7.8528784329258494,4.1207553893976545,2.6961503893000002E-2,0.40102047588418016,1,2.5976296288000001E-3,2.5976296288203046E-3,4.2337812036503386E-5,4.2337812036503386E-5,1,3.8636667822989704E-2,3.8636667822989704E-2,1.1199034151591219E-4,"0.00011199034152"]
[null,"48180","HINCHINBROOK","Urban",527,0.2273,5.5034999999999998,3.7983524335722354,8.0515952739999997E-3,0,1,7.7573797538000005E-4,7.7573797537851372E-4,1.3657358721452706E-6,1.3657358721452706E-6,0,0,0,0,"0"]
[null,"48185","HINCHINBROOK","Short rural",1053,3.94810357240216,12.17422,4.2682304512629115,0.18878722863110001,0.71918606730236412,3,4.7075041532189998E-2,4.7075041532642893E-2,3.8316072249125165E-3,3.8316072249125165E-3,9,0.17933264995935103,0.17933264995935103,6.6098759322752822E-4,"0.00066098759323"]
[null,"48187","HINCHINBROOK","Urban",678,0,5.8116899999999996,2.5636107096837781,0,0,0,0,0,0,0,0,0,0,0,"0"]
[null,"48189","HINCHINBROOK","Urban",1075,0,7.0954949768622599,3.9503359659545794,1.5141676978610001,0,3,0.1458838086584,0.14588380865494138,1.544647271396301E-3,1.544647271396301E-3,0,0,0,0,"0"]
[null,"48196","HINCHINBROOK","Urban",788,16.058358663935699,3.3164099999999999,3.8653666340176067,2.6709324526587004,0.60124720695042422,10,0.25733331876721,0.25733331876548404,1.7945769359988858E-3,1.7945769359988858E-3,4,5.7927687017041651E-2,5.7927687017041651E-2,1.1608754913234801E-4,"0.00011608754913"]
[null,"48198","HINCHINBROOK","Urban",177,0,1.33877,0.61713334004348686,0,0,0,0,0,0,0,0,0,0,0,"0"]
[null,"48203","HINCHINBROOK","Urban",1028,0.59710000000000008,11.56101,3.5664021361303893,0,0,0,0,0,0,0,0,0,0,0,"0"]
[null,"48205","HINCHINBROOK","Urban",1278,0.32488,7.5109899999999996,4.0664930666128276,1.4019415011E-2,0.31460758012631651,1,1.3507127776E-3,1.3507127775516726E-3,3.1411925059341222E-5,3.1411925059341222E-5,1,3.0311141946392135E-2,3.0311141946392135E-2,1.1062460564376691E-4,"0.00011062460564"]
[null,"4857","YENNORA","Urban",608,3.7276781200187701,0.486155299605108,2.2459435849114469,0.145736709529,0.10206247530456335,2,1.40411305015E-2,1.4041130501525528E-2,8.6177933532366566E-4,8.6177933532366566E-4,2,9.833298279445948E-3,9.833298279445948E-3,2.0486038082179059E-5,"2.0486038082e-05"]
[null,"4859","YENNORA","Short rural",236,2.03453854054424,0.51014516055594994,0.76060545928737755,1.513926717E-2,0.23920892649507036,1,3.7750521366999999E-3,3.7750521367219255E-3,1.258350712240642E-3,1.258350712240642E-3,1,5.9647944576013572E-2,5.9647944576013572E-2,1.5906118553603619E-4,"0.00015906118554"]
[null,"4860","YENNORA","Urban",211,2.1684623945475101,1.23353,2.8950134592403396,0.3169890378811,7.0876718961502324E-4,2,3.0540585572419999E-2,3.0540585572912542E-2,2.9773042012766899E-4,2.9773042012766899E-4,1,6.8286793607263526E-5,6.8286793607263526E-5,2.7314717442905412E-6,"2.7314717443e-06"]
[null,"4866","YENNORA","Urban",906,4.2899760706118899,1.0145900000000001,2.899260909700708,0.21662760383500002,0.29257909587308162,3,2.0871175597600003E-2,2.0871175598124025E-2,1.1062460564376691E-4,1.1062460564376691E-4,2,2.8188788401078385E-2,2.8188788401078385E-2,6.2823850118682445E-5,"6.2823850119e-05"]
[null,"4867","YENNORA","Urban",83,0.33932000000000001,0.27918999999999999,1.1795293135006699,0,0,0,0,0,0,0,0,0,0,0,"0"]
[null,"4869","YENNORA","Urban",1080,3.9505440707947002,1.7032960236864301,2.5638444210727331,0.61820091812369993,0,3,5.9561107120509993E-2,5.9561107120127396E-2,6.25507029442534E-4,6.25507029442534E-4,0,0,0,0,"0"]
[null,"4870","YENNORA","Urban",271,3.1950149890244002,1.62037209985438,2.7242415634579249,0.41584788548699997,0.32107153689560552,4,4.0065227545620002E-2,4.0065227545253664E-2,4.4796136606364877E-4,4.4796136606364877E-4,4,3.0933917504090379E-2,3.0933917504090379E-2,5.1897963141520282E-5,"5.1897963142e-05"]
[null,"4871","YENNORA","Urban",1264,5.8829004022063298,1.15251318345414,2.9712541788675835,0,0.85512761427052564,0,0,0,0,0,1,8.2388016487163443E-2,8.2388016487163443E-2,1.7344845576244936E-4,"0.00017344845576"]
[null,"4873","YENNORA","Urban",1539,7.8400281421589595,1.56838664532965,3.4835800275795599,4.3981413924399995,0.52413333672030971,4,0.423742771849,0.4237427718428966,3.195821940819933E-3,3.195821940819933E-3,1,5.0498083872571382E-2,5.0498083872571382E-2,1.1608754913234801E-4,"0.00011608754913"]
[null,"4874","YENNORA","Urban",23,0.66712747563245001,1.0241600000000002,3.9599956133083913,0,7.9381925236882603E-2,0,0,0,0,0,1,7.6481208840135156E-3,7.6481208840135156E-3,1.9120302210033789E-5,"1.912030221e-05"]
[null,"48999","QUAKERS HILL","Short rural",162,0,0,0.7287813350993767,0,1.5309371295684503E-2,0,0,0,0,0,1,3.8174684528648685E-3,3.8174684528648685E-3,1.0604079035735746E-5,"1.0604079036e-05"]
[null,"49001","QUAKERS HILL","Short rural",1165,2.4304254454497101,10.16164,1.767383316137664,0.19844063775000001,0.31299159093399426,1,4.9482167473999999E-2,4.9482167473754904E-2,1.4138772047647661E-4,1.4138772047647661E-4,2,7.8046021703015098E-2,7.8046021703015098E-2,1.6259587854794812E-4,"0.00016259587855"]
[null,"49006","QUAKERS HILL","Urban",1114,0,9.0168421937713212,2.4425634522454689,0,0,0,0,0,0,0,0,0,0,0,"0"]
[null,"49008","QUAKERS HILL","Short rural",970,2.9818790520192402,5.9863500000000007,1.8163439468705618,0,1.2949176554266475,0,0,0,0,0,1,0.32289420663815349,0.32289420663815349,7.4228553250150228E-4,"0.0007422855325"]
[null,"49010","QUAKERS HILL","Short rural",799,3.8395916056316799,3.5053269634368096,1.4770642343863605,0,1.2287046245728122,0,0,0,0,0,5,0.30638365557951291,0.30638365557951291,1.1240323777879891E-3,"0.0011240323778"]
[null,"49319","BELLA VISTA","Urban",852,0,7.04448855372046,4.024202101659661,7.3853541158099998E-3,0,2,7.1154838938699996E-4,7.1154838938768594E-4,2.7314717442905412E-6,2.7314717442905412E-6,0,0,0,0,"0"]
[null,"49321","BELLA VISTA","Urban",1,0,3.2224499999999998,2.9135592200573028,0,0,0,0,0,0,0,0,0,0,0,"0"]
[null,"49326","BELLA VISTA","Short rural",1,0,2.2685500000000003,0.29335859997847846,0,0,0,0,0,0,0,0,0,0,0,"0"]
[null,"49328","BELLA VISTA","Urban",708,0,6.2392342178279696,3.295719891734751,0.1660925032137,0,4,1.600232721385E-2,1.6002327213926137E-2,8.4675624073006785E-5,8.4675624073006785E-5,0,0,0,0,"0"]
[null,"49335","BELLA VISTA","Short rural",6,0,1.5474000000000001,0.11706527263169601,0,0,0,0,0,0,0,0,0,0,0,"0"]
[null,"49337","BELLA VISTA","Urban",620,0.81474000000000002,8.9966799999999996,3.2731953215376746,6.7191129576000003E-3,1.9659784305541517,1,6.4735880339999996E-4,6.4735880339685827E-4,4.097207616435812E-6,4.097207616435812E-6,6,0.18941390810782757,0.18941390810782757,3.1275351472126694E-4,"0.00031275351472"]
[null,"49339","BELLA VISTA","Urban",10,0,1.6465399999999999,1.1134486884405719,0,0,0,0,0,0,0,0,0,0,0,"0"]
[null,"49341","BELLA VISTA","Urban",721,0.850340498707573,6.9520870215229493,3.1186003184177431,0.148132342625,9.3557269029183071E-2,2,1.4271939863799999E-2,1.4271939863918079E-2,4.0972076164358119E-5,4.0972076164358119E-5,1,9.0138567561587855E-3,9.0138567561587855E-3,2.7314717442905411E-5,"2.7314717443e-05"]
[null,"49348","BELLA VISTA","Urban",943,0,6.6081517659071398,3.8700910335353647,6.6992674762000007E-2,0,1,6.4544677318000001E-3,6.4544677317585489E-3,8.8772831689442586E-5,8.8772831689442586E-5,0,0,0,0,"0"]
[null,"49353","BELLA VISTA","Urban",76,0,5.2134300000000007,2.7015169413925735,0,1.0206247530456335E-2,0,0,0,0,0,1,9.8332982794459485E-4,9.8332982794459485E-4,1.3657358721452706E-6,"1.3657358721e-06"]
[null,"49355","BELLA VISTA","Urban",4,0,0.87541000000000002,1.6394060079482293,0,0,0,0,0,0,0,0,0,0,0,"0"]
[null,"49357","BELLA VISTA","Urban",983,2.1903911004727701,7.3053220853188003,4.6557594989483722,8.6469597133000001E-4,0,1,8.3309888200999997E-5,8.3309888200861504E-5,1.3657358721452706E-6,1.3657358721452706E-6,0,0,0,0,"0"]
[null,"49360","BELLA VISTA","Short rural",0,0,2.2666300000000001,3.8105117766515297E-2,0,0.12332549099301406,0,0,0,0,0,1,3.0751829203633663E-2,3.0751829203633663E-2,1.0250609734544554E-4,"0.00010250609735"]
[null,"49362","BELLA VISTA","Urban",1082,0.121488287105711,8.4130900000000004,4.4509654487681249,2.8580611661380999,1.3996734460517479,8,0.27536239801588003,0.27536239801367379,1.8519378426289867E-3,1.8519378426289867E-3,5,0.13485276001562402,0.13485276001562402,3.6738294960707779E-4,"0.00036738294961"]
[null,"49364","BELLA VISTA","Urban",1,0,0.84951999999999994,0.94882568849507976,0,0,0,0,0,0,0,0,0,0,0,"0"]
[null,"49366","BELLA VISTA","Urban",352,0,4.7831490755442196,3.7343015411184997,0,0.44652332945746465,0,0,0,0,0,1,4.3020679972576026E-2,4.3020679972576026E-2,1.434022665752534E-4,"0.00014340226658"]
[null,"49373","BELLA VISTA","Urban",109,0,2.1128800000000001,1.805014025187986,0,1.9845481309220653E-3,0,0,0,0,0,1,1.912030221003379E-4,1.912030221003379E-4,3.8240604420067578E-5,"3.824060442e-05"]
[null,"49375","BELLA VISTA","Urban",0,0,1.35216,1.707430629099717,0,3.4020825101521118E-3,0,0,0,0,0,1,3.2777660931486495E-4,3.2777660931486495E-4,5.4629434885810824E-6,"5.4629434886e-06"]
[null,"49382","BELLA VISTA","Urban",187,0,3.4587231124321201,2.4987723114628553,0,0,0,0,0,0,0,0,0,0,0,"0"]
[null,"49391","BELLA VISTA","Urban",879,0,6.41161043378185,3.4780065190209171,0.11080866242369999,0,3,1.06759573126E-2,1.067595731255958E-2,6.1458114246537178E-5,6.1458114246537178E-5,0,0,0,0,"0"]
[null,"49395","BELLA VISTA","Urban",150,0,5.9763799999999998,4.1933767579223691,0,0,0,0,0,0,0,0,0,0,0,"0"]
[null,"49397","BELLA VISTA","Urban",50,0,4.4226529644124604,2.9647979017473371,0,1.0773261282148354E-2,0,0,0,0,0,1,1.0379592628304056E-3,1.0379592628304056E-3,2.7314717442905412E-6,"2.7314717443e-06"]
[null,"49914","SMITHFIELD","Urban",660,4.04526714269696,0.62900999999999996,2.4995687084241753,0.41031950141150003,0,3,3.9532590555550001E-2,3.9532590555117007E-2,5.0395653682160481E-4,5.0395653682160481E-4,0,0,0,0,"0"]
[null,"49915","SMITHFIELD","Urban",1146,5.2243792124689996,0.26049800218914998,4.9507013665700441,1.4798917165700001,0.33397109974659894,2,0.14258145931299998,0.14258145931609412,2.6235786103910646E-3,2.6235786103910646E-3,1,3.2176737147742572E-2,3.2176737147742572E-2,1.0379592628304056E-4,"0.00010379592628"]
[null,"49916","SMITHFIELD","Urban",955,2.1522647939579902,4.3266434746124496,3.146932743647727,6.8892170831000004E-3,0,1,6.6374763385999998E-4,6.6374763386260153E-4,5.5995170757956096E-5,5.5995170757956096E-5,0,0,0,0,"0"]
[null,"49917","SMITHFIELD","Urban",300,2.8652585870466099,1.25338764466867,4.230769309986651,0.31327509781000001,0.3869868855298027,1,3.0182762774000001E-2,3.0182762774410479E-2,5.8043774566173998E-4,5.8043774566173998E-4,1,3.7284589309565887E-2,3.7284589309565887E-2,8.8772831689442586E-5,"8.8772831689e-05"]
[null,"49918","SMITHFIELD","Urban",1221,1.66512806659735,6.1617320254337402,4.0881717031955072,0.1124813529915,1.1019912264134382,5,1.0837114145482E-2,1.0837114145472723E-2,3.1411925059341222E-5,3.1411925059341222E-5,2,0.10617230670057333,0.10617230670057333,2.6085555157974666E-4,"0.00026085555158"]
[null,"504","TRANSMISSION","Short rural",0,0,0,0,0,0.13608330040608446,0,0,0,0,0,1,3.3933052914354389E-2,3.3933052914354389E-2,7.0693860238238304E-5,"7.0693860238e-05"]
[null,"52237","BONNYRIGG","Urban",594,0,7.4542576331001298,2.9517443585711276,1.569477032172,0,3,0.1512126347594,0.15121263475642083,1.4723279058142435E-3,1.4723279058142435E-3,0,0,0,0,"0"]
[null,"52238","BONNYRIGG","Urban",151,0,2.3597151862314401,0.54744352524560247,0.36242663921560003,0,2,3.4918310937949996E-2,3.4918310938119951E-2,2.013590579623603E-4,2.013590579623603E-4,0,0,0,0,"0"]
[null,"53801","PRESTONS","Urban",674,0,3.86117,2.3475292885357795,0,0.63725258018286746,0,0,0,0,0,1,6.1396656132290638E-2,6.1396656132290638E-2,1.5159668180812503E-4,"0.00015159668181"]
[null,"53803","PRESTONS","Urban",865,6.855E-2,6.3851860483984701,4.012892502706559,0,1.3183069726839433E-2,0,0,0,0,0,2,1.2701343610951018E-3,1.2701343610951018E-3,2.7314717442905412E-6,"2.7314717443e-06"]
[null,"53807","PRESTONS","Short rural",285,3.4788099999999997,7.4238900000000001,0.75176697722143426,0.70634320582810006,7.1868993026963354E-2,2,0.17613021809032001,0.17613021809055882,1.3502527305503519E-3,1.3502527305503519E-3,2,1.792089357039341E-2,1.792089357039341E-2,2.8277544095295325E-5,"2.8277544095e-05"]
[null,"53809","PRESTONS","Short rural",617,4.56836607005999,10.37617,1.9457508320615304,0.11738602194269999,1.1934788952489455,2,2.9270792832109999E-2,2.9270792831642571E-2,3.1812237107207243E-4,3.1812237107207243E-4,2,0.29759994344491181,0.29759994344491181,6.6098759322752822E-4,"0.00066098759323"]
[null,"54647","EASTERN CREEK","Short rural",16,0,2.5090100000000004,0.53278067592904743,0,0,0,0,0,0,0,0,0,0,0,"0"]
[null,"54649","EASTERN CREEK","Urban",3,0,4.2858000000000001,0.34929691285972292,3.1469263219000001E-3,3.6855893859981212E-2,1,3.0319336361999999E-4,3.0319336361625006E-4,8.194415232871624E-6,8.194415232871624E-6,1,3.5509132675777036E-3,3.5509132675777036E-3,6.8286793607263528E-6,"6.8286793607e-06"]
[null,"54651","EASTERN CREEK","Short rural",2,0,5.20763,0.48347773422154611,0,0,0,0,0,0,0,0,0,0,0,"0"]
[null,"54656","EASTERN CREEK","Urban",3,0,0.90873000000000004,0.80302915706743161,0,0,0,0,0,0,0,0,0,0,0,"0"]
[null,"54658","EASTERN CREEK","Urban",8,0,1.7231400000000001,0.89604946530316054,0,1.5167617857761499E-2,0,0,0,0,0,1,1.4613373831954396E-3,1.4613373831954396E-3,2.7314717442905412E-6,"2.7314717443e-06"]
[null,"54663","EASTERN CREEK","Urban",5,0,0.30413000000000001,2.1973951245357091,0,0,0,0,0,0,0,0,0,0,0,"0"]
[null,"54665","EASTERN CREEK","Urban",6,1.18201,2.9504000000000001,4.2532221155452801,0,0,0,0,0,0,0,0,0,0,0,"0"]
[null,"54667","EASTERN CREEK","Urban",1,0,0.45011000000000001,1.7577636791575073,0,0,0,0,0,0,0,0,0,0,0,"0"]
[null,"54669","EASTERN CREEK","Urban",13,0,3.2998499999999997,1.3756976351891719,0,0,0,0,0,0,0,0,0,0,0,"0"]
[null,"54679","EASTERN CREEK","Urban",25,0,2.62337,1.2545176449239883,0,0,0,0,0,0,0,0,0,0,0,"0"]
[null,"54686","EASTERN CREEK","Urban",3,0,0.71787999999999996,0.98401131915538453,8.1649980244000008E-3,0,1,7.8666386235999998E-4,7.8666386235567585E-4,4.097207616435812E-6,4.097207616435812E-6,0,0,0,0,"0"]
[null,"54688","EASTERN CREEK","Short rural",12,0,2.4883699999999997,0.6646447061306664,0,0,0,0,0,0,0,0,0,0,0,"0"]
[null,"54695","EASTERN CREEK","Short rural",7,2.4653899999999997,2.6981899999999999,0.47011553959142199,0,0,0,0,0,0,0,0,0,0,0,"0"]
[null,"54697","EASTERN CREEK","Urban",2,0,1.63791,1.7960720242187758,0,0,0,0,0,0,0,0,0,0,0,"0"]
[null,"54699","EASTERN CREEK","Urban",1,0,0.44836000000000004,1.2589930910056655,0,0,0,0,0,0,0,0,0,0,0,"0"]
[null,"54701","EASTERN CREEK","Short rural",9,0,7.1385399999999999,1.323713363361499,0,1.006449409253333E-2,0,0,0,0,0,1,2.5096320384574598E-3,2.5096320384574598E-3,3.5346930119119156E-6,"3.5346930119e-06"]
[null,"54703","EASTERN CREEK","Short rural",2,0,2.8325800000000001,0.20825717029992891,0,0,0,0,0,0,0,0,0,0,0,"0"]
[null,"5494","DUNDAS","Urban",832,1.6249719925101298,4.8634064714996104,2.7696425411061294,1.2134094286E-2,0.54327005083991531,1,1.1690699065999999E-3,1.1690699065563517E-3,1.0925886977162165E-5,1.0925886977162165E-5,2,5.2341827299967496E-2,5.2341827299967496E-2,9.5601511050168948E-5,"9.560151105e-05"]
[null,"5495","DUNDAS","Urban",2822,4.36096209288214,2.5249744098959601,3.6961964233519837,5.2836751190909998,0.20001410090935956,4,0.50906029177849998,0.50906029177581169,3.9019073867190379E-3,3.9019073867190379E-3,1,1.9270533155969768E-2,1.9270533155969768E-2,1.1335607738805746E-4,"0.00011335607739"]
[null,"5496","DUNDAS","Short rural",965,6.0712044807523595,1.19370343023144,2.4081418291963956,3.5637097800792001,2.5373865388217832E-3,5,0.88862889258330002,0.88862889258067934,6.2917535612032095E-3,6.2917535612032095E-3,1,6.3271004913223287E-4,6.3271004913223287E-4,3.5346930119119156E-6,"3.5346930119e-06"]
[null,"5498","DUNDAS","Urban",2433,4.7246317638197501,2.5220085924656099,3.7152489822352415,2.2657504330570002,0.21773328064973516,3,0.21829570337610002,0.21829570337868856,2.0318622719035107E-3,2.0318622719035107E-3,1,2.0977702996151357E-2,2.0977702996151357E-2,4.3703547908648659E-5,"4.3703547909e-05"]
[null,"55163","NARELLAN","Urban",477,2.21781647253813,10.4471043789309,4.5980175438261739,0.16922525419599999,0.10716559906979152,2,1.63041548414E-2,1.6304154841670242E-2,1.2018475674878382E-4,1.2018475674878382E-4,1,1.0324963193418246E-2,1.0324963193418246E-2,1.9120302210033789E-5,"1.912030221e-05"]
[null,"55165","NARELLAN","Short rural",350,1.4540999999999999,3.1247600000000002,1.6321692109990726,0,0,0,0,0,0,0,0,0,0,0,"0"]
[null,"55167","NARELLAN","Urban",596,0.35298000000000002,4.3696899999999994,1.143153532995459,0.18389673501760001,0.18286193492067601,4,1.7717691469340002E-2,1.7717691469340598E-2,6.6921057735118259E-5,6.6921057735118259E-5,4,1.7617992750673991E-2,1.7617992750673991E-2,5.8726642502246637E-5,"5.8726642502e-05"]
[null,"55169","NARELLAN","Urban",1027,0.11612,9.949543341741089,4.4392462197990321,5.4404969475000002E-2,8.0799459616112661E-3,1,5.2416942772999997E-3,5.2416942772935482E-3,7.2384001223699341E-5,7.2384001223699341E-5,1,7.7846944712280423E-4,7.7846944712280423E-4,4.097207616435812E-6,"4.0972076164e-06"]
[null,"55171","NARELLAN","Urban",1635,0,19.336428172497598,5.5061895172614603,0,2.041249506091267E-2,0,0,0,0,0,1,1.9666596558891897E-3,1.9666596558891897E-3,4.097207616435812E-6,"4.0972076164e-06"]
[null,"55173","NARELLAN","Urban",145,0,4.1099199999999998,3.4167588930641988,0,0,0,0,0,0,0,0,0,0,0,"0"]
[null,"55175","NARELLAN","Urban",619,0,7.3963199999999993,3.7533541000017565,0.18619314071000001,0.25047832480994925,1,1.7938940681E-2,1.7938940680628131E-2,4.7800755525084474E-5,4.7800755525084474E-5,1,2.4132552860806931E-2,2.4132552860806931E-2,7.7846944712280423E-5,"7.7846944712e-05"]
[null,"55177","NARELLAN","Urban",926,0,6.5985640486138299,2.819778714722132,0,7.016795177188731E-2,0,0,0,0,0,1,6.7603925671190892E-3,6.7603925671190892E-3,2.0486038082179059E-5,"2.0486038082e-05"]
[null,"55354","EMU PLAINS","Urban",926,3.99192018528572,3.6874231656937,3.8867220121845607,0.17376136420320001,2.0070869275518231,4,1.6741190320700001E-2,1.6741190320756726E-2,9.150430343373312E-5,9.150430343373312E-5,3,0.19337454213704885,0.19337454213704885,4.9029917810015217E-4,"0.0004902991781"]
[null,"55356","EMU PLAINS","Urban",685,5.4594820788243794,2.4689299999999998,3.4104080401031194,2.2614776472600004,1.3098017664085631,3,0.21788403809599999,0.21788403809856788,2.3190195109026694E-3,2.3190195109026694E-3,2,0.12619399458622299,0.12619399458622299,2.5129540047472978E-4,"0.00025129540047"]
[null,"55361","EMU PLAINS","Urban",635,3.8473895447856696,2.1093315582764398,2.9531466269049358,0.50355073753199997,1.1244591463242344,2,4.85150353864E-2,4.8515035386216446E-2,8.9865420387158805E-4,8.9865420387158805E-4,2,0.10833699805792359,0.10833699805792359,2.4446672111400346E-4,"0.00024446672111"]
[null,"55363","EMU PLAINS","Urban",50,9.128E-2,2.2319299999999997,1.0478907385791707,0,0,0,0,0,0,0,0,0,0,0,"0"]
[null,"55864","JASPER RD","Urban",343,0,2.0694699999999999,4.5655945342039539,0.63293152183222001,9.3557269029183071E-2,4,6.0980339993175002E-2,6.0980339993456797E-2,7.3871630988303844E-4,7.3871630988303844E-4,1,9.0138567561587855E-3,9.0138567561587855E-3,2.7314717442905411E-5,"2.7314717443e-05"]
[null,"55865","JASPER RD","Urban",463,3.7000074484680301,0.37985000000000002,1.8793444082445345,4.9585352584999999E-2,0.31327509780984031,1,4.7773440807999997E-3,4.7773440807641569E-3,4.5069283780793926E-5,4.5069283780793926E-5,1,3.0182762774410479E-2,3.0182762774410479E-2,7.1018265351554074E-5,"7.1018265352e-05"]
[null,"55866","JASPER RD","Urban",454,3.1228306643361696,4.9669999999999999E-2,1.7801948918160619,6.8041650203000002E-4,1.8954560951874568,1,6.5555321863000003E-5,6.5555321862972992E-5,1.3657358721452706E-6,1.3657358721452706E-6,5,0.18261937214390486,0.18261937214390486,4.5342430955222984E-4,"0.00045342430955"]
[null,"55867","JASPER RD","Urban",805,1.5900732169795999,4.1108376877686599,3.2218054895471528,0,0.80374199302343641,0,0,0,0,0,1,7.7437223950636846E-2,7.7437223950636846E-2,1.434022665752534E-4,"0.00014340226658"]
[null,"55870","JASPER RD","Urban",839,5.1306755918340698,1.0801400000000001,2.6817823009012955,0.95455210760000009,0.50740643104539518,3,9.1967156090999994E-2,9.1967156090823982E-2,1.129127781019676E-3,1.129127781019676E-3,3,4.8886515543439958E-2,4.8886515543439958E-2,1.2837917198165542E-4,"0.00012837917198"]
[null,"55874","JASPER RD","Urban",1341,5.4709996239180496,0.70100874143942493,3.3697625811521754,5.3197308315400003,0.36189652701743086,6,0.51253411085590006,0.5125341108576108,5.117980154028849E-3,5.117980154028849E-3,1,3.4867236815868757E-2,3.4867236815868757E-2,1.0106445453875003E-4,"0.00010106445454"]
[null,"55875","JASPER RD","Urban",942,6.2675294975282902,1.3795510123625199,3.2053180401748906,0.74616174653939993,2.4123033051985239,6,7.1889604838220003E-2,7.1889604837982762E-2,2.4310098524185818E-4,2.4310098524185818E-4,4,0.23241546777819358,0.23241546777819358,6.0092378374391911E-4,"0.00060092378374"]
[null,"55876","JASPER RD","Urban",1481,4.6384913073479606,2.1367640368547498,4.7558235382032414,2.2133807057619999,0.36572386984135202,4,0.21325009628489996,0.21325009628437899,1.4244625146475169E-3,1.4244625146475169E-3,1,3.5235985501347981E-2,3.5235985501347981E-2,2.9363321251123318E-4,"0.00029363321251"]
[null,"55879","JASPER RD","Urban",722,5.1833361079993603,1.03071,2.6219960062109231,0.80265049155390988,2.678431209555173,6,7.7332062288344994E-2,7.7332062288481648E-2,1.1226348869034122E-3,1.1226348869034122E-3,5,0.25805579304184889,0.25805579304184889,7.9485827758854748E-4,"0.00079485827759"]
[null,"55880","JASPER RD","Urban",259,3.0672563375533102,7.417E-2,1.0336146562079458,3.6870069203800003E-2,0,3,3.5522790034100003E-3,3.5522790034498491E-3,3.8240604420067585E-5,3.8240604420067585E-5,0,0,0,0,"0"]
[null,"55885","JASPER RD","Urban",1612,5.6241495125612104,2.9130157745352698,3.7879281435219143,11.4332588439477,4.940390818492558,8,1.1015473040836301,1.1015473040813435,9.5011924066525748E-3,9.5011924066525748E-3,9,0.47598626616006973,0.47598626616006973,1.0693711878897469E-3,"0.0010693711879"]
[null,"55888","JASPER RD","Urban",241,2.46194409051372,0.71228000000000002,0.90131305223730918,0,8.5052062753802796E-2,0,0,0,0,0,1,8.1944152328716231E-3,8.1944152328716231E-3,2.7314717442905411E-5,"2.7314717443e-05"]
[null,"55890","JASPER RD","Urban",1859,7.2489616840804905,1.57822159848345,4.9856736085708615,2.5991910377287999,2.2488474159295073,6,0.25042132951195001,0.25042132951655682,1.3916848537160308E-3,1.3916848537160308E-3,3,0.21666716743648645,0.21666716743648645,4.3430400734219607E-4,"0.00043430400734"]
[null,"55891","JASPER RD","Urban",207,1.0808613987125499,3.0426799999999998,1.0354430667754431,0.14909626601199999,0,2,1.43648099032E-2,1.4364809903223957E-2,1.1745328500449327E-4,1.1745328500449327E-4,0,0,0,0,"0"]
[null,"57040","NORTH PARRAMATTA","Urban",493,0,3.3885289911787901,3.4497096585675031,5.1031237652000004E-4,1.339569988372394E-2,1,4.9166491396999998E-5,4.9166491397229741E-5,5.4629434885810824E-6,5.4629434885810824E-6,1,1.2906203991772808E-3,1.2906203991772808E-3,9.5601511050168944E-6,"9.560151105e-06"]
[null,"57444","MEADOW FLAT","Short rural",41,16.452591445200898,0,5.7157676649772948E-2,6.8325157078899995E-2,7.2209201277978571E-2,2,1.7037220317500001E-2,1.7037220317415433E-2,6.3624474214414481E-5,6.3624474214414481E-5,4,1.8005726202679297E-2,1.8005726202679297E-2,6.0089781202502562E-5,"6.0089781203e-05"]
[null,"57448","MEADOW FLAT","Short rural",143,63.151679217583698,0.27376999999999996,0.22863070659909179,0.2731588748796,0.46977089327683741,10,6.8113534339110007E-2,6.811353433954262E-2,5.1253048672722772E-4,5.1253048672722772E-4,7,0.11713972641476088,0.11713972641476088,3.4639991516736772E-4,"0.00034639991517"]
[null,"61617","MALDON","Short rural",492,15.166408731106699,0.84038999999999997,3.0484094213212241,0.10126865605,0.1763412767762178,1,2.5251846876999998E-2,2.5251846877098725E-2,1.6613057155986003E-4,1.6613057155986003E-4,4,4.3971581068184225E-2,4.3971581068184225E-2,1.0604079035735746E-4,"0.00010604079036"]
[null,"6419","MOOREBANK","Urban",394,3.3732428185025602,1.68803530538261,2.833537202577022,0.46914717815000001,1.0240268355557856,2,4.5200394424999998E-2,4.5200394424519875E-2,1.4203653070310815E-4,1.4203653070310815E-4,2,9.8660759403774348E-2,9.8660759403774348E-2,2.3490657000898655E-4,"0.00023490657001"]
[null,"6420","MOOREBANK","Urban",193,2.5137685726872201,1.28146102226092,1.9522522002378067,0.1180522631,0.70238828490848804,1,1.1373848343000001E-2,1.1373848343225813E-2,3.5509132675777034E-4,3.5509132675777034E-4,4,6.7672212464798154E-2,6.7672212464798154E-2,7.7846944712280423E-5,"7.7846944712e-05"]
[null,"6421","MOOREBANK","Urban",197,2.8281179386776398,2.4559239734248699,2.5149377725900095,1.9845481309000001E-3,0.27457640925686,1,1.912030221E-4,1.912030221003379E-4,2.7314717442905412E-6,2.7314717442905412E-6,3,2.6454303843453892E-2,2.6454303843453892E-2,5.3263699013665555E-5,"5.3263699014e-05"]
[null,"6423","MOOREBANK","Urban",578,3.12548,0.85809493130944603,2.2961432670570541,0,0.24452468041718303,0,0,0,0,0,1,2.3558943794505918E-2,2.3558943794505918E-2,6.2823850118682445E-5,"6.2823850119e-05"]
[null,"6426","MOOREBANK","Urban",19,1.63989855521452,0.51980999999999999,3.3380692845351669,0,0,0,0,0,0,0,0,0,0,0,"0"]
[null,"6427","MOOREBANK","Urban",1,0,2.9797547667473498,5.3789336659684066,0,0,0,0,0,0,0,0,0,0,0,"0"]
[null,"6429","MOOREBANK","Urban",125,1.3507390061493199,0.94604999999999995,3.8521632107115096,0.39447146704745001,1.7010412550760559E-3,6,3.8005697849319009E-2,3.8005697850058591E-2,2.5539260809116559E-4,2.5539260809116559E-4,1,1.6388830465743247E-4,1.6388830465743247E-4,1.3657358721452706E-6,"1.3657358721e-06"]
[null,"6430","MOOREBANK","Urban",742,4.9723493968714703,1.1105999999999998,2.5144805111768114,5.6857303950999999E-2,1.3326240699141667,1,5.4779665832000004E-3,5.4779665831746803E-3,2.8680453315050682E-5,2.8680453315050682E-5,2,0.12839282934037688,0.12839282934037688,3.1002204297697644E-4,"0.00031002204298"]
[null,"6431","MOOREBANK","Urban",2,0,2.1094107749506401,5.1949570767092963,0,1.5592878171530511E-2,0,0,0,0,0,1,1.5023094593597977E-3,1.5023094593597977E-3,2.7314717442905412E-6,"2.7314717443e-06"]
[null,"679","GUILDFORD TS","Short rural",0,0,0,0,0,0.1156708053451718,0,0,0,0,0,1,2.8843094977201229E-2,2.8843094977201229E-2,6.0089781202502562E-5,"6.0089781203e-05"]
[null,"68179","SMITHFIELD","Urban",878,3.2943323513215401,0.16958028226441102,2.6345452916620347,0.55921731260900009,0.43546656129947031,3,5.3878280156199998E-2,5.3878280156130928E-2,5.435628771138177E-4,5.435628771138177E-4,1,4.1955405992302713E-2,4.1955405992302713E-2,8.7407095817297319E-5,"8.7407095817e-05"]
[null,"68181","SMITHFIELD","Urban",1121,2.8630974186185001,3.5357396237439698,3.6606316467698967,0,0.76568119494110964,0,0,0,0,0,2,7.3770223133926796E-2,7.3770223133926796E-2,1.993974373332095E-4,"0.00019939743733"]
[null,"68186","SMITHFIELD","Urban",509,1.7988164787805299,1.1176700000000002,1.7680355487367667,0,0.52165265155665708,0,0,0,0,0,1,5.0259080094945958E-2,5.0259080094945958E-2,8.7407095817297319E-5,"8.7407095817e-05"]
[null,"68188","SMITHFIELD","Urban",1070,4.2863734527716399,0.36651999999999996,5.5867602484375798,0.10124030536549999,0.34035000445313418,4,9.7540855988700013E-3,9.754085598861522E-3,7.6481208840135142E-5,7.6481208840135142E-5,2,3.2791318290207948E-2,3.2791318290207948E-2,8.4675624073006771E-5,"8.4675624073e-05"]
[null,"68190","SMITHFIELD","Urban",342,2.2418095011317201,1.6876577673152302,3.2773360776682958,0.27916922064999999,0,1,2.6896802266000001E-2,2.689680226602896E-2,4.6844740414582779E-4,4.6844740414582779E-4,0,0,0,0,"0"]
[null,"68195","SMITHFIELD","Urban",929,3.7332705102571198,0.31055129490251199,3.4898781684610749,0,1.0697281439421624,0,0,0,0,0,2,0.1030638918555707,0.1030638918555707,2.4856392873043927E-4,"0.00024856392873"]
[null,"68197","SMITHFIELD","Urban",765,5.2040693414083599,0.76527000000000001,2.0713948368730613,0.69625036105000004,2.2964056943526753E-2,1,6.7080848831999995E-2,6.7080848832159257E-2,1.0475194139354226E-3,1.0475194139354226E-3,1,2.2124921128753383E-3,2.2124921128753383E-3,5.4629434885810824E-6,"5.4629434886e-06"]
[null,"68202","SMITHFIELD","Urban",476,2.66642339881595,0.113924160630947,3.5440299864043596,9.9269932578E-2,0.35615551278154922,2,9.5642483125999989E-3,9.5642483126333298E-3,1.2428196436521961E-4,1.2428196436521961E-4,1,3.4314113787649925E-2,3.4314113787649925E-2,9.1504303433733133E-5,"9.1504303434e-05"]
[null,"68204","SMITHFIELD","Urban",1088,2.0246980994620101,7.0243267152546398,3.7187209935490615,4.6424250919600001E-2,0,2,4.4727849813000001E-3,4.4727849812757608E-3,2.458324569861487E-5,2.458324569861487E-5,0,0,0,0,"0"]
[null,"7004","TRANSMISSION","Short rural",0,0,0,0,0,0.32220556439898956,0,0,0,0,0,3,8.034357216075784E-2,8.034357216075784E-2,2.1561627372662683E-4,"0.00021561627373"]
[null,"7017","TRANSMISSION","Short rural",0,0,0,0,5.3299292658999997E-3,0,1,1.3290445725E-3,1.3290445724788802E-3,3.5346930119119156E-6,3.5346930119119156E-6,0,0,0,0,"0"]
[null,"7035","TRANSMISSION","Short rural",0,0,0,0,6.8041650203000002E-4,0,1,1.6966526456999999E-4,1.6966526457177193E-4,3.5346930119119156E-6,3.5346930119119156E-6,0,0,0,0,"0"]
[null,"7091","TRANSMISSION","Short rural",0,0,0,0,1.1751360004000001E-2,0,1,2.9302605068999999E-3,2.9302605068749778E-3,5.655508819059065E-5,5.655508819059065E-5,0,0,0,0,"0"]
[null,"7091/1","TRANSMISSION","Short rural",0,0,0,0,6.3633118284000006E-2,0,1,1.586723693E-2,1.5867236930472588E-2,4.2416316142942983E-5,4.2416316142942983E-5,0,0,0,0,"0"]
[null,"7093","TRANSMISSION","Short rural",0,0,0,0,3.6444808890299996E-2,0,3,9.0876957336999999E-3,9.0876957336255351E-3,3.181223710720724E-5,3.181223710720724E-5,0,0,0,0,"0"]
[null,"7093/1","TRANSMISSION","Short rural",0,0,0,0,1.2105743598999999E-2,0,1,3.0186278322000002E-3,3.0186278321727759E-3,1.0604079035735746E-5,1.0604079035735746E-5,0,0,0,0,"0"]
[null,"7099","TRANSMISSION","Short rural",0,0,0,0,1.4033590354000001E-3,0,1,3.4993460818E-4,3.499346081792796E-4,3.5346930119119156E-6,3.5346930119119156E-6,0,0,0,0,"0"]
[null,"7158","TRANSMISSION","Short rural",0,0,0,0,0,0.92281488087876029,0,0,0,0,0,3,0.2301085150754657,0.2301085150754657,4.7718355660810856E-4,"0.00047718355661"]
[null,"76225","BYLONG","Short rural",28,18.477063753375248,0,0,8.1919311775699999E-2,0.19294060435700164,5,2.0426990915470001E-2,2.0426990915838959E-2,4.9485702166766827E-5,4.9485702166766827E-5,5,4.8110706585133084E-2,4.8110706585133084E-2,1.343183344526528E-4,"0.00013431833445"]
[null,"77674","ILFORD HALL","Short rural",22,23.055709424441098,0.14204,5.7157676649772948E-2,9.5166061509100008E-2,4.3376552004439427E-2,5,2.3730134345390001E-2,2.3730134345438691E-2,9.897140433318019E-5,9.897140433318019E-5,1,1.0816160616450462E-2,1.0816160616450462E-2,3.181223710720724E-5,"3.1812237107e-05"]
[null,"7962","GREYSTANES","Urban",870,5.1735729804913699,0.32750999999999997,3.2963568822867608,0.47683050794199999,1.1791759733625142,5,4.5940651540200002E-2,4.5940651539829319E-2,1.7039925473488172E-3,1.7039925473488172E-3,3,0.11360873852440434,0.11360873852440434,3.2504513757057439E-4,"0.00032504513757"]
[null,"7964","GREYSTANES","Short rural",305,2.1468104836096398,6.8400000000000002E-2,0.908171973435282,1.2980458448E-2,0.30526602856719054,1,3.2367423634000001E-3,3.2367423633505917E-3,1.078914121116864E-3,1.078914121116864E-3,1,7.6119614011523104E-2,7.6119614011523104E-2,2.0854688770280302E-4,"0.0002085468877"]
[null,"7966","GREYSTANES","Urban",535,4.3254368845285702,8.0120000000000011E-2,1.8496427391161283,0.43157177335399999,0.40824990121825339,2,4.1580159248000001E-2,4.158015924820517E-2,1.461902835400289E-3,1.461902835400289E-3,1,3.9333193117783792E-2,3.9333193117783792E-2,8.1944152328716237E-5,"8.1944152329e-05"]
[null,"7967","GREYSTANES","Urban",102,0.36502122941182896,0.28061999999999998,0.31754264805429477,0.43420840482630002,0,2,4.1834187808369998E-2,4.1834187808329516E-2,2.3501733955823089E-4,2.3501733955823089E-4,0,0,0,0,"0"]
[null,"7970","GREYSTANES","Urban",806,5.8671158925066704,1.3826088091572601,3.1896828752699808,3.4983399488999999E-2,0.95237047268570674,1,3.3705061628000002E-3,3.3705061628417059E-3,1.1235020542805687E-3,1.1235020542805687E-3,2,9.1756964570080007E-2,9.1756964570080007E-2,1.8710581448390208E-4,"0.00018710581448"]
[null,"7972","GREYSTANES","Urban",602,4.5798355884431903,1.0726106189551499,2.8196974238042234,0.62696694591259994,7.4845815223346462E-2,4,6.0405677719640005E-2,6.0405677719284748E-2,1.7023440853742471E-3,1.7023440853742471E-3,1,7.2110854049270284E-3,7.2110854049270284E-3,1.5023094593597976E-5,"1.5023094594e-05"]
[null,"7973","GREYSTANES","Urban",315,2.0215761475688301,0.19394,1.236394215828938,3.9814745584E-2,4.1675510749363369E-2,2,3.8359864197999999E-3,3.8359864198060142E-3,4.4829472967101335E-4,4.4829472967101335E-4,1,4.0152634641070955E-3,4.0152634641070955E-3,9.5601511050168944E-6,"9.560151105e-06"]
[null,"7974","GREYSTANES","Urban",766,4.4060943055839097,0.18704219555395499,3.5437759522859222,3.2685219961000003E-2,0.56106010729925238,1,3.14908605E-3,3.1490860499517759E-3,1.0496953499839253E-3,1.0496953499839253E-3,4,5.4055825819509809E-2,5.4055825819509809E-2,1.0789313389947638E-4,"0.0001078931339"]
[null,"7976","GREYSTANES","Urban",938,3.6714626478214401,0.95474999999999999,3.9434427501506164,0.14203901208200001,0.92664222370268146,3,1.36848726131E-2,1.368487261310471E-2,1.3762729052347507E-3,1.3762729052347507E-3,2,8.9278153962136342E-2,8.9278153962136342E-2,2.2124921128753382E-4,"0.00022124921129"]
[null,"7977","GREYSTANES","Urban",144,2.7280333233234799,0.72072105644649698,2.0254546718084612,1.17844409158E-2,8.0799459616112651E-2,2,1.13538224735E-3,1.1353822473502621E-3,1.9818361399357831E-4,1.9818361399357831E-4,2,7.7846944712280427E-3,7.7846944712280427E-3,1.5023094593597976E-5,"1.5023094594e-05"]
[null,"7979","GREYSTANES","Urban",358,6.2852521512045598,0.82876287605791399,2.0703780653140043,6.8365333328099992E-2,0.59068657582516038,3,6.5867177194500002E-3,6.5867177194650793E-3,5.4530839431282457E-4,5.4530839431282457E-4,2,5.6910213792293426E-2,5.6910213792293426E-2,1.297449078538007E-4,"0.00012974490785"]
[null,"7981","GREYSTANES","Urban",716,4.1921372130438002,0.28827999999999998,2.3737862550181057,3.0429599312E-2,0.10099932452014082,1,2.9317663095E-3,2.9317663095040931E-3,9.7725543650136436E-4,9.7725543650136436E-4,1,9.7308680890350538E-3,9.7308680890350538E-3,2.5948981570760141E-5,"2.5948981571e-05"]
[null,"8610","SEVEN HILLS","Urban",1319,5.2075426404263299,0.82732633310844406,3.9756339536397687,0.14437587652100001,1.9922028165699075,3,1.39100198581E-2,1.3910019857799581E-2,6.0092378374391911E-5,6.0092378374391911E-5,4,0.19194051947129634,0.19194051947129634,4.4249842257506765E-4,"0.00044249842258"]
[null,"8611","SEVEN HILLS","Urban",145,1.0050852460772899,2.4258924308721097,2.6038497140452184,0,4.9755456710974637E-2,0,0,0,0,0,2,4.7937329112298999E-3,4.7937329112298999E-3,8.194415232871624E-6,"8.1944152329e-06"]
[null,"8614","SEVEN HILLS","Urban",19,0,1.2685377841694201,1.3209774159058629,1.2899562850999999E-2,0,3,1.2428196436599999E-3,1.2428196436521963E-3,6.8286793607263528E-6,6.8286793607263528E-6,0,0,0,0,"0"]
[null,"8615","SEVEN HILLS","Urban",932,6.7563074596852104,0.76961193444318698,3.5691793641302603,2.6976104497051998,3.2763472107144067,8,0.25990363367212005,0.25990363367686142,3.6273944764178387E-3,3.6273944764178387E-3,6,0.31566253212893641,0.31566253212893641,7.6344635252920622E-4,"0.00076344635253"]
[null,"8617","SEVEN HILLS","Urban",396,2.6037662016444503,1.6280614569574801,4.0362871397593105,1.4798775412337002,0.62279372951472101,5,0.14258009357974999,0.14258009358022197,2.1769829801995613E-3,2.1769829801995613E-3,3,6.0003605542702461E-2,6.0003605542702461E-2,1.5432815355241556E-4,"0.00015432815355"]
[null,"8618","SEVEN HILLS","Urban",79,0.74954999999999994,0.89749999999999996,0.35564776582081009,0,0,0,0,0,0,0,0,0,0,0,"0"]
[null,"8620","SEVEN HILLS","Urban",1038,3.45749243460559,2.72200759918816,2.7106456574388327,6.5617666413999992E-2,1.3785521838012202,2,6.3219913521000001E-3,6.3219913521604578E-3,2.7314717442905411E-5,2.7314717442905411E-5,4,0.13281781356612757,0.13281781356612757,2.8543879727836155E-4,"0.00028543879728"]
[null,"8622","SEVEN HILLS","Urban",141,1.58707177848374,0.99936999999999998,2.1269158987147625,3.9605910555999997E-2,2.6153509296794358E-2,1,3.8158660267999999E-3,3.8158660267738858E-3,3.0046189187195952E-5,3.0046189187195952E-5,2,2.5197826841080241E-3,2.5197826841080241E-3,6.8286793607263528E-6,"6.8286793607e-06"]
[null,"8640","KELLYVILLE","Short rural",14,0,0.41984999999999995,1.0082309320077816,0,0,0,0,0,0,0,0,0,0,0,"0"]
[null,"8641","KELLYVILLE","Urban",806,0.17956999999999998,6.9470914215380599,4.5114528776254001,4.1533757310999999E-3,0,1,4.0016061054E-4,4.001606105385643E-4,1.3657358721452706E-6,1.3657358721452706E-6,0,0,0,0,"0"]
[null,"8645","KELLYVILLE","Urban",806,0.256609553182855,6.6216800000000005,3.9874109753708011,3.7139400736E-3,0,1,3.578227985E-4,3.578227985020609E-4,1.3657358721452706E-6,1.3657358721452706E-6,0,0,0,0,"0"]
[null,"8647","KELLYVILLE","Urban",597,0,3.6294287020320897,3.8831217136409144,0,1.2483516510689405,0,0,0,0,0,2,0.12027352958047326,0.12027352958047326,2.8270732553407099E-4,"0.00028270732553"]
[null,"8648","KELLYVILLE","Short rural",322,6.4736509923823293,3.2712858183195901,3.4102556196320535,5.5567347666000003E-3,0.74236275440277533,1,1.3855996607000001E-3,1.3855996606694709E-3,1.4138772047647663E-5,1.4138772047647663E-5,6,0.18511187303382701,0.18511187303382701,3.499346081792796E-4,"0.00034993460818"]
[null,"8650","KELLYVILLE","Short rural",234,0.37613000000000002,5.3464099999999997,0.60239110506491933,0,0.39379105055010694,0,0,0,0,0,7,9.8193771870913008E-2,9.8193771870913008E-2,1.9440811565515535E-4,"0.00019440811566"]
[null,"8651","KELLYVILLE","Urban",579,1.9454258892953602,2.4058332206939599,2.4245251245801089,0.92224786712499995,0.11056768157994364,4,8.8854775841599995E-2,8.8854775841771289E-2,8.9728846799944279E-4,8.9728846799944279E-4,1,1.065273980273311E-2,1.065273980273311E-2,3.5509132675777037E-5,"3.5509132676e-05"]
[null,"8652","KELLYVILLE","Urban",733,0.64822999999999997,8.7094499803240097,4.2487206309664556,0.83671384268210003,0,3,8.0613925589530011E-2,8.0613925589246738E-2,1.0324963193418246E-3,1.0324963193418246E-3,0,0,0,0,"0"]
[null,"8675","PLUMPTON","Urban",834,4.88395202831384,0.65317525023275902,2.3688681544850283,5.3100837846000004E-2,0.97108192649154335,2,5.1160465769999998E-3,5.1160465770561832E-3,4.3703547908648659E-5,4.3703547908648659E-5,3,9.3559735921311768E-2,9.3559735921311768E-2,2.1715200367109804E-4,"0.00021715200367"]
[null,"8676","PLUMPTON","Urban",1224,3.51185602657175,2.16398568544381,2.557130299322274,7.0423107959999995E-2,2.3640220842419488,1,6.7849758128000004E-3,6.7849758128177041E-3,9.4235775178023667E-5,9.4235775178023667E-5,5,0.22776377139766676,0.22776377139766676,5.0532227269375007E-4,"0.00050532227269"]
[null,"8677","PLUMPTON","Short rural",425,3.1515355934604998,0.72889999999999999,0.92955148484348094,8.1735032306000002E-2,0,1,2.0381039907E-2,2.0381039906684103E-2,2.1915096673853876E-4,2.1915096673853876E-4,0,0,0,0,"0"]
[null,"8679","PLUMPTON","Urban",1128,2.97160621419187,5.9282724629246406,3.1648993066746396,0.47650418158549995,0.29768221963830976,7,4.5909211341820001E-2,4.5909211342163268E-2,3.1821645820984801E-4,3.1821645820984801E-4,1,2.8680453315050682E-2,2.8680453315050682E-2,7.6481208840135156E-5,"7.648120884e-05"]
[null,"8680","PLUMPTON","Urban",1427,2.9561227403583099,4.2273429991604798,3.9438796888343335,0.39820667014210004,0.28556230069589289,4,3.8365569251949998E-2,3.8365569252368871E-2,8.3105027820039713E-4,8.3105027820039713E-4,2,2.7512749144366477E-2,2.7512749144366477E-2,9.6967246922314215E-5,"9.6967246922e-05"]
[null,"8682","PLUMPTON","Urban",960,3.3906665032872003,5.9679330231923204,3.7295968292449335,0,8.5902583381340825E-2,0,0,0,0,0,1,8.2763593852003391E-3,8.2763593852003391E-3,1.6388830465743248E-5,"1.6388830466e-05"]
[null,"8683","PLUMPTON","Urban",1239,2.66861355680442,5.6485207061688696,3.6392470546793287,0,9.5258310284259129E-2,0,0,0,0,0,1,9.1777450608162177E-3,9.1777450608162177E-3,2.185177395432433E-5,"2.1851773954e-05"]
[null,"8685","PLUMPTON","Urban",1675,1.8433139399855198,6.3263257259588999,3.7749470000694432,2.9411003300405003,1.6301645361145536,11,0.28336287875695998,0.28336287875270078,2.5457316656787854E-3,2.5457316656787854E-3,4,0.15705962529670611,0.15705962529670611,4.0425781815500012E-4,"0.00040425781816"]
[null,"8686","PLUMPTON","Urban",1077,8.2929665274788089,2.0902390319398299,3.2461495791176,0.1824366746053,1.4748027681509404,4,1.757702067446E-2,1.7577020674509634E-2,1.3384211547023652E-4,1.3384211547023652E-4,1,0.14209116013799394,0.14209116013799394,2.7861011791763523E-4,"0.00027861011792"]
[null,"8689","PLUMPTON","Urban",667,3.2805433911707702,0.70235000000000003,1.9524452661678173,0.11202774198999998,0.9606630488042025,3,1.0793410597600001E-2,1.0793410597564073E-2,9.150430343373312E-5,9.150430343373312E-5,2,9.2555920055284985E-2,9.2555920055284985E-2,2.4036951349756762E-4,"0.0002403695135"]
[null,"8690","PLUMPTON","Urban",760,4.1731886028058298,0.56495000000000006,2.0690710597746125,1.288793906904,0.11907288785532391,3,0.12416997402299999,0.12416997402370371,1.170435642428497E-3,1.170435642428497E-3,1,1.1472181326020273E-2,1.1472181326020273E-2,5.7360906630101363E-5,"5.736090663e-05"]
[null,"8693","PLUMPTON","Urban",398,3.0034355569357101,0.41948000000000002,1.0882688266204588,7.5072620724000005E-2,0,1,7.2329371788999999E-3,7.2329371788813534E-3,6.1458114246537178E-5,6.1458114246537178E-5,0,0,0,0,"0"]
[null,"8694","PLUMPTON","Urban",1426,3.2049967396970103,6.86565259678021,3.7145478480683383,0.90238112280700011,0.89602348111131247,7,8.6940697017399995E-2,8.6940697016959709E-2,9.8537843175281262E-4,9.8537843175281262E-4,3,8.6328164478302549E-2,8.6328164478302549E-2,2.7587864617334467E-4,"0.00027587864617"]
[null,"8711","HORSLEY PARK","Short rural",433,0,0,2.6570444584472739,0.45981626809309001,0.63831573096729,6,0.114657490737857,0.11465749073833928,1.7118682273487788E-3,1.7118682273487788E-3,6,0.15916722632639355,0.15916722632639355,4.4183662648898941E-4,"0.00044183662649"]
[null,"8714","HORSLEY PARK","Urban",29,5.3570544691776405,0.75931619707245601,4.0234380940484424,1.0240550852999999E-5,4.082499012182534E-2,1,9.8663481152000006E-7,9.8663481152025523E-7,3.523695755429483E-8,3.523695755429483E-8,1,3.9333193117783794E-3,3.9333193117783794E-3,8.194415232871624E-6,"8.1944152329e-06"]
[null,"8715","HORSLEY PARK","Short rural",68,3.6084785983834498,0.42312,0.36048457543597184,3.8226513399959999E-3,0.20636465492831019,2,9.5319726819559998E-4,9.5319726819801352E-4,3.7453909049697784E-6,3.7453909049697784E-6,2,5.1458060867413669E-2,5.1458060867413669E-2,1.131101763811813E-4,"0.00011311017638"]
[null,"8716","HORSLEY PARK","Short rural",344,16.108912478583299,1.41717,2.2072211642371138,0.42211914092024999,0.28435739647354735,4,0.105257523165932,0.10525752316565984,1.6166962055108726E-3,1.6166962055108726E-3,8,7.090594181895303E-2,7.090594181895303E-2,1.6613057155986003E-4,"0.00016613057156"]
[null,"8718","HORSLEY PARK","Short rural",222,20.060420462248,5.3828940424294593,1.1382544850212779,1.3856121103508999E-2,-0.19760429246466849,2,3.4550932347830001E-3,3.4550932347610476E-3,3.2504080935159595E-5,3.2504080935159595E-5,4,-4.92736205860521E-2,-4.92736205860521E-2,2.6156728288148173E-4,"0.00026156728288"]
[null,"8719","HORSLEY PARK","Short rural",22,1.6060228997966799,3.52962,0.30135559402707907,7.7686937507000001E-6,0,1,1.9371627182000001E-6,1.9371627182072041E-6,6.9184382793114418E-8,6.9184382793114418E-8,0,0,0,0,"0"]
[null,"8721","HORSLEY PARK","Urban",17,3.3510695930101302,3.0636715903938101,2.262671731610947,6.8641958356480007E-4,4.2526031376901394E-3,2,6.6133693993899998E-5,6.613369399387605E-5,5.4835996361133341E-6,5.4835996361133341E-6,1,4.0972076164358119E-4,4.0972076164358119E-4,1.3657358721452706E-6,"1.3657358721e-06"]
[null,"87218","KANDOS","Short rural",242,49.127275862019999,0.39055000000000001,1.0478907385791707,0.17499461911195002,0.41760562812117169,4,4.363578523219E-2,4.3635785232052603E-2,4.9485702166766827E-5,4.9485702166766827E-5,6,0.10413205613092504,0.10413205613092504,2.4389381782192215E-4,"0.00024389381782"]
[null,"87220","KANDOS","Short rural",742,185.8104647612308,0.17365,1.6956777406099308,0.64802584146506015,1.6347006461280897,33,0.16158849104056,0.16158849103955319,1.0886854476688699E-3,1.0886854476688699E-3,25,0.40762079813368207,0.40762079813368207,1.1098936057403414E-3,"0.0011098936057"]
[null,"87221","KANDOS","Short rural",294,2.0273903399330098,0.40085999999999999,0.43820885431492596,0,0,0,0,0,0,0,0,0,0,0,"0"]
[null,"87222","KANDOS","Long rural",312,236.91856574456239,0.34896070203538299,1.143153532995459,2.2016009950640996,2.8873332510223051,32,493.05396825631993,493.05396825396826,3.4349206349206343,3.4349206349206343,26,646.62539682539682,646.62539682539682,1.7015873015873015,"1.7015873016"]
[null,"87223","KANDOS","Short rural",425,5.0797239372836502,0.1172,0.74304979644704827,0,0,0,0,0,0,0,0,0,0,0,"0"]
[null,"8734","NORTH ROCKS","Urban",618,4.48062001295588,1.1682900000000001,3.3080932585588472,0.88449892660700002,0.23119985725242059,2,8.5217821214200004E-2,8.5217821214248451E-2,1.3397868905745105E-3,1.3397868905745105E-3,2,2.2275152074689362E-2,2.2275152074689362E-2,4.2337812036503386E-5,"4.2337812037e-05",null,null," "]
[null,"8735","NORTH ROCKS","Urban",512,3.3240909892436199,0.341706987113848,2.4912617927510752,0.83245245316999994,0.18753979837213516,2,8.0203358296999996E-2,8.0203358297060878E-2,1.5190030408044322E-3,1.5190030408044322E-3,1,1.8068685588481931E-2,1.8068685588481931E-2,3.6874868547922304E-5,"3.6874868548e-05"]
[null,"8737","NORTH ROCKS","Urban",721,2.6996231277838003,4.3824034931571694,3.6939812458391508,1.3128045178154999,0.16400872767691638,5,0.12648329728807001,0.12648329728879165,1.5325024454924435E-3,1.5325024454924435E-3,4,1.5801564040720781E-2,1.5801564040720781E-2,7.5115472967989889E-5,"7.5115472968e-05"]
[null,"8738","NORTH ROCKS","Urban",1337,5.8941896477716096,1.1672229355597201,3.5420383589157693,3.8270734923409999,1.7648303021414079E-2,4,0.36872273650258003,0.3687227364976523,3.320103905185153E-3,3.320103905185153E-3,1,1.7003411608208618E-3,1.7003411608208618E-3,1.1335607738805746E-4,"0.00011335607739"]
[null,"8740","NORTH ROCKS","Urban",2,0,0.58333000000000002,1.6779766432367915,0,0,0,0,0,0,0,0,0,0,0,"0"]
[null,"8741","NORTH ROCKS","Urban",485,3.9140553376518401,2.2385799999999998,3.6058688767717491,2.9513491035849997,0.19980147075247506,6,0.28435030578859999,0.28435030578826181,3.9032731225911834E-3,3.9032731225911834E-3,4,1.9250047117887588E-2,1.9250047117887588E-2,9.1504303433733133E-5,"9.1504303434e-05"]
[null,"8743","NORTH ROCKS","Urban",738,4.7559936259438498,0.53389121006320994,3.905774571067818,2.3024815278559996,1.6741081018706849,6,0.22183459277110001,0.22183459277127421,4.9163443887425126E-3,4.9163443887425126E-3,3,0.16129340650035645,0.16129340650035645,3.3050808105915551E-4,"0.00033050808106"]
[null,"8744","NORTH ROCKS","Urban",589,3.3455261206142999,1.65473363841135,2.8951862024408879,0,0.24452468041718303,0,0,0,0,0,1,2.3558943794505918E-2,2.3558943794505918E-2,6.2823850118682445E-5,"6.2823850119e-05"]
[null,"8745","NORTH ROCKS","Urban",8,0,1.14374847879592,0.98900562992398178,0,0,0,0,0,0,0,0,0,0,0,"0"]
[null,"8762","BONNYRIGG","Urban",1621,7.4962833071155801,1.1420699999999999,2.4819133371923692,2.6394490140999999E-2,2.1073066081633871,1,2.5430001938999999E-3,2.543000193934494E-3,2.5948981570760141E-5,2.5948981570760141E-5,6,0.20303029475311593,0.20303029475311593,5.285397825202197E-4,"0.00052853978252"]
[null,"8764","BONNYRIGG","Urban",1257,4.0053962878686198,2.6112081950260699,3.0517861698406268,0.74784861245800005,0.33085252411229288,11,7.2052127407020009E-2,7.2052127406768043E-2,6.6101616211831091E-4,6.6101616211831091E-4,3,3.1876275255870619E-2,3.1876275255870619E-2,7.6481208840135156E-5,"7.648120884e-05"]
[null,"8766","BONNYRIGG","Urban",1201,6.0380000000000003E-2,7.7637200881859902,3.3849538214350874,0.2465517545799,6.8041650203042231E-2,5,2.375424402404E-2,2.3754244024222691E-2,8.6041359945152038E-5,8.6041359945152038E-5,1,6.555532186297299E-3,6.555532186297299E-3,1.3657358721452706E-5,"1.3657358721e-05"]
[null,"8767","BONNYRIGG","Urban",525,3.2808140125259904,0.9437152433200019,5.4437987377717469,0.13812454991000001,0,1,1.3307730338E-2,1.3307730338183516E-2,7.921268058442569E-5,7.921268058442569E-5,0,0,0,0,"0"]
[null,"8769","BONNYRIGG","Urban",1065,2.3488198770292201,4.8589361508453202,4.9412786060316938,0.20554248498500002,0,2,1.9803170146240001E-2,1.9803170146106424E-2,2.1168906018251694E-4,2.1168906018251694E-4,0,0,0,0,"0"]
[null,"8770","BONNYRIGG","Urban",943,4.8467774676294706,0.74193111496181907,4.27039482195205,1.278658536132,0,3,0.12319347287169999,0.12319347287511984,2.3490657000898654E-3,2.3490657000898654E-3,0,0,0,0,"0"]
[null,"8772","BONNYRIGG","Urban",408,0,2.6609175704988099,1.8065890367223341,0.14127147623,0,1,1.3610923702E-2,1.3610923701799766E-2,4.3703547908648659E-5,4.3703547908648659E-5,0,0,0,0,"0"]
[null,"8776","BONNYRIGG","Urban",837,1.7214909436319699,3.2293198908014999,0.9263620864864236,3.8904854088907208,0,9,0.37483221294403402,0.37483221294922447,2.5063712778196578E-3,2.5063712778196578E-3,0,0,0,0,"0"]
[null,"8777","BONNYRIGG","Urban",662,0,4.35965070728688,0.89562268798417577,2.329045492264,0.63278734688829275,6,0.22439392111341,0.22439392111252501,1.8583506024227828E-3,1.8583506024227828E-3,2,6.0966449332564877E-2,6.0966449332564877E-2,1.2701343610951017E-4,"0.00012701343611"]
[null,"8779","BONNYRIGG","Urban",1048,0.27030999999999999,6.02046381187054,2.0265825832943496,2.6171106128016,0.57636947859493692,4,0.25214780662640002,0.25214780662199565,1.437378016836437E-3,1.437378016836437E-3,2,5.5530820561426705E-2,5.5530820561426705E-2,1.1608754913234801E-4,"0.00011608754913"]
[null,"8780","BONNYRIGG","Urban",779,0,5.1257338889388704,2.1919181489420816,1.8592691716729,0.49670404648220834,2,0.17913291141591001,0.17913291141128307,1.0600749857370029E-3,1.0600749857370029E-3,1,4.7855384959970285E-2,4.7855384959970285E-2,9.9698718666604749E-5,"9.9698718667e-05"]
[null,"8798","KURRAJONG","Short rural",1091,31.856727369825901,1.3285,3.8867220121845607,2.2260676385020002,3.3431130799761419,15,0.55508112120301989,0.55508112120462338,3.2801951150542579E-3,3.2801951150542579E-3,12,0.83362199992930619,0.83362199992930619,2.170301509313916E-3,"0.0021703015093"]
[null,"8799","KURRAJONG","Short rural",1160,55.828507546105399,0.37289999999999995,3.3532503634533462,3.764305070037,3.2928331355448521,9,0.93864833340319997,0.93864833339224474,6.3412392633699771E-3,6.3412392633699771E-3,15,0.82108444381605461,0.82108444381605461,2.3399667738856879E-3,"0.0023399667739"]
[null,"8801","KURRAJONG","Short rural",710,77.675002040682301,2.5729699999999998,2.5720954492397827,0.92185095750329982,1.5236368275154155,14,0.22986815594528001,0.22986815595065568,1.707256724753455E-3,1.707256724753455E-3,11,0.37992647838535221,0.37992647838535221,9.7204057827577673E-4,"0.00097204057828"]
[null,"8802","KURRAJONG","Short rural",824,40.660954822847998,0.92065999999999992,3.867669453301303,1.5654399163556001,0.71266540915790588,8,0.39035028807440009,0.39035028807748046,2.9019829627796828E-3,2.9019829627796828E-3,6,0.17770669117387156,0.17770669117387156,4.8425294263193243E-4,"0.00048425294263"]
[null,"9015","KINGSWOOD","Urban",4,0,1.4747282094485399,4.7631397208144124,0,0,0,0,0,0,0,0,0,0,0,"0"]
[null,"9016","KINGSWOOD","Urban",625,1.4190099999999999,2.48366,1.7147302994931883,0,6.8041650203042231E-2,0,0,0,0,0,1,6.555532186297299E-3,6.555532186297299E-3,1.3657358721452706E-5,"1.3657358721e-05"]
[null,"9017","KINGSWOOD","Urban",641,2.3598823911404403,0.50993982455785203,3.0674619802044814,0.14030755285999999,1.2016438932733104,1,1.3518053662E-2,1.3518053662493888E-2,8.3583035375290563E-4,8.3583035375290563E-4,4,0.11577342988175458,0.11577342988175458,3.0046189187195955E-4,"0.00030046189187"]
[null,"9019","KINGSWOOD","Urban",1064,3.6242352570400098,2.7255475344409801,4.3820885431492593,2.3991376351949998,0.27556868332232104,7,0.231147009813754,0.23114700981081096,1.7378880351425555E-3,1.7378880351425555E-3,1,2.654990535450406E-2,2.654990535450406E-2,7.3749737095844608E-5,"7.3749737096e-05"]
[null,"9020","KINGSWOOD","Urban",629,1.29561757372269,2.1888011711103101,2.3815698604072062,1.1567080535E-2,0,1,1.1144404717E-3,1.1144404716705409E-3,2.32175098264696E-5,2.32175098264696E-5,0,0,0,0,"0"]
[null,"9022","KINGSWOOD","Urban",990,4.1253089475742897,1.3130299999999999,4.1725103954334246,1.0061659023780001,0.61676920840299321,3,9.6939932204500007E-2,9.6939932204871307E-2,2.7068884985919266E-3,2.7068884985919266E-3,2,5.9423167797040724E-2,5.9423167797040724E-2,1.2701343610951017E-4,"0.00012701343611"]
[null,"9025","KINGSWOOD","Urban",2315,7.05538117097037,8.2720915382742692,8.8784924395980642,0.969659192846,3.1407600473410526,3,9.3422661407000007E-2,9.3422661406648164E-2,3.3547624065177429E-3,3.3547624065177429E-3,7,0.30259926851186686,0.30259926851186686,7.0335397415481431E-4,"0.00070335397415"]
[null,"9026","KINGSWOOD","Urban",973,1.8709089185055601,1.24753625657351,1.3336791218280355,0.103394957621,0.26451191516432671,2,9.9616774513999994E-3,9.961677451427604E-3,1.0516166215518584E-4,1.0516166215518584E-4,2,2.5484631374230748E-2,2.5484631374230748E-2,5.3263699013665555E-5,"5.3263699014e-05"]
[null,"9027","KINGSWOOD","Urban",867,1.29617229323163,4.3714711321861399,3.2008298923872851,0.58577293079729986,0.27684446426362808,11,5.6436804371600001E-2,5.643680437199363E-2,1.3979984285432897E-3,1.3979984285432897E-3,1,2.6672821582997136E-2,2.6672821582997136E-2,8.4675624073006771E-5,"8.4675624073e-05"]
[null,"9029","KINGSWOOD","Urban",840,4.0754888718727695,2.5034584241541102,3.7724066588850143,1.8357746733760001,2.7797849176701215,2,0.1768693134681,0.17686931346395177,1.3828184327063695E-3,1.3828184327063695E-3,4,0.26782080452768758,0.26782080452768758,6.282385011868245E-4,"0.00062823850119"]
[null,"9030","KINGSWOOD","Urban",1018,4.0536259245870898,3.4643610983604498,3.7152489822352415,0,0.84915979453396706,0,0,0,0,0,1,8.181304168499029E-2,8.181304168499029E-2,2.1305479605466222E-4,"0.00021305479605"]
[null,"9032","KINGSWOOD","Urban",667,7.3530395549866299,3.5507585664202503,3.6771438644687269,1.8068885471814999,0.26188947656275108,7,0.17408625441013001,0.17408625441474121,1.1130747357983957E-3,1.1130747357983957E-3,2,2.5231970237883875E-2,2.5231970237883875E-2,6.4189585990827712E-5,"6.4189585991e-05"]
[null,"9033","KINGSWOOD","Urban",1290,2.3582567773258001,1.48634,3.2008298923872851,0.11260893109,0.70097075052925806,1,1.0849405768E-2,1.0849405768322029E-2,1.3561757210402536E-3,1.3561757210402536E-3,1,6.7535638877583626E-2,6.7535638877583626E-2,1.5705962529670613E-4,"0.0001570596253"]
[null,"9034","KINGSWOOD","Urban",510,1.2178499999999999,2.8840700000000004,2.0195712416253109,2.9768221963999999E-2,1.3420506735360467,1,2.8680453314999998E-3,2.8680453315050682E-3,3.4143396803631763E-5,3.4143396803631763E-5,3,0.1293010436953535,0.1293010436953535,2.8270732553407099E-4,"0.00028270732553"]
[null,"9046","SHERWOOD","Urban",1188,5.7472070019700796,0.27668999999999999,3.3905730561350489,0.21258763085499999,0.14671480825030983,2,2.0481940874600001E-2,2.0481940874562624E-2,9.4235775178023667E-5,9.4235775178023667E-5,1,1.4135366276703551E-2,1.4135366276703551E-2,3.1411925059341222E-5,"3.1411925059e-05"]
[null,"9047","SHERWOOD","Urban",242,1.1124865657485399,0.53255999999999992,0.56014523116777493,0.15077024256999999,0,1,1.4526090637E-2,1.4526090636834077E-2,4.2128169930844597E-5,4.2128169930844597E-5,0,0,0,0,"0"]
[null,"9049","SHERWOOD","Urban",896,2.5939326030501504,0.77085000000000004,2.502744134904725,2.0057258608600002,0.69402483207103083,2,0.19324340897759998,0.19324340898109782,1.4905018472996085E-3,1.4905018472996085E-3,1,6.6866428300232442E-2,6.6866428300232442E-2,1.3930505895881761E-4,"0.00013930505896"]
[null,"9050","SHERWOOD","Urban",1118,3.0953556263702597,1.31330901299508,4.0505232117568823,1.3419897278708002,1.0149546155287132,9,0.12929517183174999,0.12929517183183889,5.1906395936273666E-4,5.1906395936273666E-4,3,9.7786688445601372E-2,9.7786688445601372E-2,2.0759185256608113E-4,"0.00020759185257"]
[null,"9052","SHERWOOD","Urban",1183,4.2448063427527307,0.8710512365953661,3.0437758390008156,0.28247207575,0.20922807437435487,2,2.7215018723999999E-2,2.7215018724238808E-2,6.2414129357038863E-4,6.2414129357038863E-4,1,2.0158261472864192E-2,2.0158261472864192E-2,4.9166491397229741E-5,"4.9166491397e-05"]
[null,"9053","SHERWOOD","Urban",7,0,1.03599,0.16278506309855334,0,0,0,0,0,0,0,0,0,0,0,"0"]
[null,"9055","SHERWOOD","Urban",1732,2.6956004922406502,2.23280118139989,2.6437025865466182,0.16236438780000001,0,1,1.5643138680000002E-2,1.5643138679551929E-2,9.4235775178023667E-5,9.4235775178023667E-5,0,0,0,0,"0"]
[null,"9056","SHERWOOD","Urban",1538,4.8380061692212202,1.8166099999999998,4.0715165913050528,4.7823729282922001,0,8,0.46076189458845007,0.46076189458541567,2.1428635410534525E-3,2.1428635410534525E-3,0,0,0,0,"0"]
[null,"9057","SHERWOOD","Urban",861,1.2081996112025299,2.6267475358827101,2.2844881817028564,0.30214745293299999,0,3,2.9110660114500003E-2,2.9110660114776442E-2,1.1472181326020274E-4,1.1472181326020274E-4,0,0,0,0,"0"]
[null,"9059","SHERWOOD","Urban",982,4.8726109674735296,0.56968999922754493,2.9404957278064532,0.18650499827100001,0.83358109170622885,2,1.7968986869799999E-2,1.7968986869815327E-2,9.28700393058784E-5,9.28700393058784E-5,2,8.031209796150264E-2,8.031209796150264E-2,2.0212890907750006E-4,"0.00020212890908"]
[null,"9060","SHERWOOD","Urban",1286,1.2391854522330399,3.19673956522103,2.4601172098299222,0,0,0,0,0,0,0,0,0,0,0,"0"]
[null,"9062","SHERWOOD","Short rural",888,3.0814374309833501,1.4697978563932901,4.7197710161137429,3.9840172484249998,0.30703794654122807,4,0.9934346661061999,0.99343466610846454,6.0751469309300483E-3,6.0751469309300483E-3,4,7.6561450638012091E-2,7.6561450638012091E-2,1.5906118553603619E-4,"0.00015906118554"]
[null,"A045","RIVERSTONE","Urban",140,0.94662453594720208,0.98473658887999604,1.1490369631786088,0,3.4020825101521118E-3,0,0,0,0,0,1,3.2777660931486495E-4,3.2777660931486495E-4,1.3657358721452706E-6,"1.3657358721e-06"]
[null,"A046","RIVERSTONE","Urban",577,33.6227270717213,9.9700197455135715,3.2071807453483645,1.8445666109541001,1.2185834291051094,5,0.17771638036309001,0.1777163803629033,1.6129340650035645E-3,1.6129340650035645E-3,13,0.11740548424896818,0.11740548424896818,2.9226747663908792E-4,"0.00029226747664"]
[null,"A047","RIVERSTONE","Urban",1,0,0.61465999999999998,0.24399723042373458,0,0,0,0,0,0,0,0,0,0,0,"0"]
[null,"A048","RIVERSTONE","Urban",306,8.7555123691537897,1.4950899999999998,3.5529313419146176,0.75234219643139999,1.5309371295684503E-2,6,7.2485065678389998E-2,7.2485065678238092E-2,8.7133948642868254E-4,8.7133948642868254E-4,1,1.4749947419168922E-3,1.4749947419168922E-3,2.7314717442905412E-6,"2.7314717443e-06"]
[null,"A049","RIVERSTONE","Urban",373,0.77263000000000004,3.4898200000000004,1.3650574161381679,0.51684721001,0,1,4.9796095633999997E-2,4.979609563428871E-2,5.0122506507731431E-4,5.0122506507731431E-4,0,0,0,0,"0"]
[null,"A051","RIVERSTONE","Short rural",541,6.5064026172266107,0.67840999999999996,2.2100968304578874,0.96724040832700009,0.41533757311440361,5,0.241186242977,0.24118624297479765,2.5096320384574602E-3,2.5096320384574602E-3,3,0.10356650524901913,0.10356650524901913,2.3328973878618641E-4,"0.00023328973879"]
[null,"A052","RIVERSTONE","Short rural",520,12.132560845242001,0.62925539957869292,1.4032743089167989,0,6.6340608947966173E-2,0,0,0,0,0,2,1.6542363295747764E-2,1.6542363295747764E-2,7.7763246262062141E-5,"7.7763246262e-05"]
[null,"A053","RIVERSTONE","Urban",143,4.7382782336800302,3.2623559139948304,2.3307630367185128,3.4956397792E-2,0.30094254871053888,1,3.3679046607E-3,3.3679046607102371E-3,1.2291622849307435E-5,1.2291622849307435E-5,3,2.8994572565644094E-2,2.8994572565644094E-2,6.9652529479408807E-5,"6.9652529479e-05"]
[null,"A054","RIVERSTONE","Urban",430,2.7000900000000003,0.6555700000000001,1.7209185706184709,0,4.5928113887053507E-2,0,0,0,0,0,1,4.4249842257506767E-3,4.4249842257506767E-3,8.194415232871624E-6,"8.1944152329e-06"]
[null,"A055","RIVERSTONE","Urban",404,3.95793083001471,8.8778100000000002,1.1598689779890365,4.0399729808000003E-2,2.1688276002219713E-2,1,3.8923472356E-3,3.8923472356140213E-3,2.5948981570760141E-5,2.5948981570760141E-5,2,2.0895758843822638E-3,2.0895758843822638E-3,4.097207616435812E-6,"4.0972076164e-06"]
[null,"A095","LUDDENHAM","Short rural",345,30.456496031043301,5.6960000000000004E-2,2.8578838324886471,0.56375342262309991,4.5392285891704551,4,0.14057474108019,0.14057474108373688,1.2654200982644657E-3,1.2654200982644657E-3,17,1.1318793962744336,1.1318793962744336,2.7393870842317347E-3,"0.0027393870842"]
[null,"A096","LUDDENHAM","Short rural",673,18.701612973944201,2.0918673304079296,2.9721991857881931,0.21143942800600005,0.87532747917455378,7,5.2723480965499996E-2,5.2723480965678131E-2,3.499346081792796E-4,3.499346081792796E-4,8,0.21826729348556079,0.21826729348556079,4.7011417058428475E-4,"0.00047011417058"]
[null,"A098","LUDDENHAM","Short rural",476,30.399577258712299,1.0643499999999999,2.781673596955617,2.7961007384267993,0.22460832238900089,9,0.69722173129449005,0.6972217312926372,3.6371991092573617E-3,3.6371991092573617E-3,5,5.60072107737443E-2,5.60072107737443E-2,1.4492241348838854E-4,"0.00014492241349"]
[null,"A099","LUDDENHAM","Urban",2,0.55354692771825798,0.23432136529594699,0.59062932538098711,0,0,0,0,0,0,0,0,0,0,0,"0"]
[null,"A314","HOMEPRIDE","Urban",536,3.03438598095447,0.78393318014429403,1.9119623890526716,0.45113031618599997,0.32277257815068161,2,4.3464544131399996E-2,4.3464544131023235E-2,7.4705752206346307E-4,7.4705752206346307E-4,2,3.1097805808747811E-2,3.1097805808747811E-2,8.4675624073006771E-5,"8.4675624073e-05"]
[null,"A315","HOMEPRIDE","Urban",1187,0.441560177104735,2.87042136567822,1.9330167367892699,1.1482028472E-2,0.64724619755643931,1,1.1062460564000001E-3,1.1062460564376692E-3,6.8286793607263528E-6,6.8286793607263528E-6,3,6.2359499922153054E-2,6.2359499922153054E-2,1.1745328500449327E-4,"0.000117453285"]
[null,"A317","HOMEPRIDE","Urban",677,0,4.1415683983497802,2.3726786662616797,2.3545246039E-2,0,1,2.2684872835999998E-3,2.2684872836332944E-3,1.3657358721452706E-6,1.3657358721452706E-6,0,0,0,0,"0"]
[null,"A318","HOMEPRIDE","Urban",3,0,2.91296,4.2823547482483608,0,0,0,0,0,0,0,0,0,0,0,"0"]
[null,"A319","HOMEPRIDE","Urban",377,0,1.79464,2.7245159203058438,9.6392337787999996E-4,0,1,9.2870039305999994E-5,9.28700393058784E-5,1.3657358721452706E-6,1.3657358721452706E-6,0,0,0,0,"0"]
[null,"A321","HOMEPRIDE","Urban",90,0,1.5278198469372801,3.7400935190190094,0,0,0,0,0,0,0,0,0,0,0,"0"]
[null,"A322","HOMEPRIDE","Urban",1481,3.04734624621898,1.62007222086831,1.8863557499135735,3.3595564788000002E-3,0,1,3.2367940169999998E-4,3.2367940169842913E-4,1.3657358721452706E-6,1.3657358721452706E-6,0,0,0,0,"0"]
[null,"A324","HOMEPRIDE","Urban",1114,5.8027649232636502,0.70828999999999998,2.3117104778352551,0.49143081858999998,1.1059603226752823,2,4.73473312151E-2,4.7347331215532237E-2,3.0592483536054062E-4,3.0592483536054062E-4,5,0.10655471274477402,0.10655471274477402,2.2534641890396964E-4,"0.0002253464189"]
[null,"A325","HOMEPRIDE","Urban",1383,3.7761795652316699,2.6837722964072102,2.6228514661047817,2.4719956779311998,0.37422907611673228,7,0.238166581531052,0.23816658153579731,6.2687276531467925E-4,6.2687276531467925E-4,1,3.6055427024635142E-2,3.6055427024635142E-2,6.0092378374391904E-5,"6.0092378374e-05"]
[null,"A326","HOMEPRIDE","Urban",377,1.0287228511045301,2.6600956302349501,0.93962838323683595,0,0,0,0,0,0,0,0,0,0,0,"0"]
[null,"A327","HOMEPRIDE","Urban",703,0.32622000000000001,1.6649400000000001,0.77480406125247836,0,2.679139976744788E-2,0,0,0,0,0,1,2.5812407983545615E-3,2.5812407983545615E-3,8.6041359945152052E-5,"8.6041359945e-05"]
[null,"A328","HOMEPRIDE","Urban",545,0,1.65143,0.98438220896831252,0,0,0,0,0,0,0,0,0,0,0,"0"]
[null,"A339","CABRAMATTA","Urban",788,0.39555676188755096,2.1766731938117601,1.8791513423145181,0,0,0,0,0,0,0,0,0,0,0,"0"]
[null,"A341","CABRAMATTA","Urban",249,1.9085639391419,0.49464810988091501,1.6877518761144956,7.3527508251000004E-2,0,1,7.0840719688000002E-3,7.0840719688175183E-3,7.3749737095844608E-5,7.3749737095844608E-5,0,0,0,0,"0"]
[null,"A343","CABRAMATTA","Urban",430,2.4011880303998598,0.89083458693083795,3.095802026458037,2.1546522564000001E-3,0,1,2.0759185257E-4,2.0759185256608113E-4,1.3657358721452706E-6,1.3657358721452706E-6,0,0,0,0,"0"]
[null,"A344","CABRAMATTA","Urban",626,3.4148577789064798,0.13688375153608001,3.096614935637044,0.39080005301200005,0.41278601123178954,3,3.7651972258800001E-2,3.7651972259172967E-2,1.0994173770769429E-3,1.0994173770769429E-3,1,3.977022859687028E-2,3.977022859687028E-2,7.6481208840135156E-5,"7.648120884e-05"]
[null,"A346","CABRAMATTA","Urban",199,3.6342258290489498,1.19432379503819,3.3258451627556687,5.6587972419000002E-2,2.9980852120715485E-2,1,5.4520176015999998E-3,5.4520176016039203E-3,3.8240604420067578E-5,3.8240604420067578E-5,2,2.8885313695872473E-3,2.8885313695872473E-3,6.8286793607263528E-6,"6.8286793607e-06"]
[null,"A347","CABRAMATTA","Urban",1375,5.9677563921419701,0.80179114276133001,3.6427984516551679,2.92012082121E-2,6.4639567692890129E-2,2,2.81341589658E-3,2.8134158966192577E-3,6.8286793607263526E-5,6.8286793607263526E-5,2,6.2277555769824338E-3,6.2277555769824338E-3,1.3657358721452706E-5,"1.3657358721e-05"]
[null,"A348","CABRAMATTA","Urban",811,6.1352429507622199,1.1712499999999999,3.1772250421015267,0.18959522322389999,0,5,1.8266717289714001E-2,1.8266717289942992E-2,1.0925886977162164E-4,1.0925886977162164E-4,0,0,0,0,"0"]
[null,"A350","CABRAMATTA","Urban",678,2.89708536802772,0.79301999999999995,0.94538289110487506,0.34773535856999999,0,1,3.350286668E-2,3.3502866679595636E-2,8.5904786357937515E-4,8.5904786357937515E-4,0,0,0,0,"0"]
[null,"A352","CABRAMATTA","Urban",670,0.301461530842563,2.1234464089709801,1.9148482166381953,5.3157539221E-3,0,1,5.1215095204999999E-4,5.1215095205447644E-4,1.3657358721452706E-6,1.3657358721452706E-6,0,0,0,0,"0"]
[null,"AB1213","ABBOTSBURY","Urban",939,0,7.9435507534039296,3.1930939183953928,3.7848167925000002E-2,0,1,3.6465147786E-3,3.6465147786278727E-3,4.0972076164358119E-5,4.0972076164358119E-5,0,0,0,0,"0"]
[null,"AB1215","ABBOTSBURY","Urban",231,0,2.2756074151367303,1.0237352693416812,9.8660392793999997E-3,0,1,9.5055216701000003E-4,9.5055216700917918E-4,3.1685072233639304E-4,3.1685072233639304E-4,0,0,0,0,"0"]
[null,"AB1223","ABBOTSBURY","Urban",966,0,5.2029149183324197,2.8866201719669751,0.1023885082122,0,7,9.8647102045199969E-3,9.8647102045052882E-3,9.2870039305878387E-5,9.2870039305878387E-5,0,0,0,0,"0"]
[null,"AB1230","ABBOTSBURY","Urban",578,0,5.5734542340160793,2.6265095574103663,0,0,0,0,0,0,0,0,0,0,0,"0"]
[null,"AB1241","ABBOTSBURY","Urban",647,0.21478,4.9123511535645905,2.2655778819259336,0.20174349285099999,6.1379238620661018E-2,5,1.94371529323E-2,1.9437152932371492E-2,1.434022665752534E-4,1.434022665752534E-4,1,5.9136363263890216E-3,5.9136363263890216E-3,1.3657358721452706E-5,"1.3657358721e-05"]
[null,"AB1245","ABBOTSBURY","Urban",908,0,7.2339252981162696,2.8009598672278484,0,0,0,0,0,0,0,0,0,0,0,"0"]
[null,"AB1246","ABBOTSBURY","Urban",753,0,5.8675230605784998,4.5963714027386589,0.19211843441400001,6.8041650203042236E-3,2,1.8509818274899999E-2,1.8509818275184754E-2,1.0529823574239709E-3,1.0529823574239709E-3,1,6.555532186297299E-4,6.555532186297299E-4,5.4629434885810824E-6,"5.4629434886e-06"]
[null,"AB1263","ABBOTSBURY","Urban",482,0,5.13858798890708,2.2687685504535895,0,0,0,0,0,0,0,0,0,0,0,"0"]
[null,"AB1265","ABBOTSBURY","Urban",471,0,2.7134600677539802,1.6847053719490628,1.162378191E-3,0.41505406623855762,1,1.1199034152E-4,1.1199034151591219E-4,1.3657358721452706E-6,1.3657358721452706E-6,1,3.9988746336413521E-2,3.9988746336413521E-2,8.3309888200861504E-5,"8.3309888201e-05"]
[null,"AB1271","ABBOTSBURY","Urban",773,0,3.6954849510000001,3.1169173423830427,7.6405103041000001E-3,0,2,7.3613163509000002E-4,7.3613163508630083E-4,2.7314717442905412E-6,2.7314717442905412E-6,0,0,0,0,"0"]
[null,"AB1280","ABBOTSBURY","Urban",603,0,6.9627532997497399,3.3906848311471713,4.7189719484400004E-2,0,3,4.54653471843E-3,4.5465347183716058E-3,3.8240604420067585E-5,3.8240604420067585E-5,0,0,0,0,"0"]
[null,"AB1287","ABBOTSBURY","Urban",760,0,7.0403638003509803,3.3537177862312761,0,0,0,0,0,0,0,0,0,0,0,"0"]
[null,"AB1289","ABBOTSBURY","Urban",1022,0,7.4991893785818498,4.3350211016840596,3.0193482277700002E-3,0.10759085938356053,2,2.9090174076200001E-4,2.9090174076694267E-4,2.7314717442905412E-6,2.7314717442905412E-6,1,1.0365935269582604E-2,1.0365935269582604E-2,3.0046189187195952E-5,"3.0046189187e-05"]
[null,"APA2","ALBION PARK","Urban",1580,1.5859401404640501,8.71056181870029,3.1375753968948694,2.0483371779999999E-2,1.341696289941239,1,1.9734883351999999E-3,1.9734883352499162E-3,2.32175098264696E-5,2.32175098264696E-5,7,0.12926690029854987,0.12926690029854987,6.8150220020049004E-4,"0.0006815022002"]
[null,"APB2","ALBION PARK","Short rural",1480,9.5587904557966201,4.8878699999999995,3.3650502482550375,0.72689745432843,5.7365490025871138,6,0.18125552295560998,0.18125552295783115,5.5070517125587644E-3,5.5070517125587644E-3,5,1.4304372415255735,1.4304372415255735,3.0327666042204234E-3,"0.0030327666042"]
[null,"APC2","ALBION PARK","Short rural",1695,51.368354092629104,18.72017,4.0123672871666898,10.791992784971409,5.3228982953839941,24,2.6910374831158999,2.6910374831557675,3.1611648924396746E-2,3.1611648924396746E-2,31,1.327291364744972,1.327291364744972,4.1037785868297339E-3,"0.0041037785868"]
[null,"APD2","ALBION PARK","Urban",447,11.3860996827612,2.0560714067013599,3.4171374039006861,1.6586569771869999,0.39173562570022336,3,0.15980475440120001,0.15980475439971811,8.2353873090359813E-4,8.2353873090359813E-4,2,3.7742110826734551E-2,3.7742110826734551E-2,9.1504303433733133E-5,"9.1504303434e-05"]
[null,"APE2","ALBION PARK","Short rural",719,22.244252853125399,3.5123111567415197,2.8273489314517404,0.102473560275,2.0626968012490177,5,2.5552295783179999E-2,2.5552295783111238E-2,2.3682443179809834E-4,2.3682443179809834E-4,13,0.51434378424233851,0.51434378424233851,1.3608568095860875E-3,"0.0013608568096"]
[null,"APF2","ALBION PARK","Short rural",0,3.218E-2,6.1067900000000002,0.5080847491045688,0,0.91856227774107013,0,0,0,0,0,1,0.22904810717189211,0.22904810717189211,4.2416316142942985E-4,"0.00042416316143"]
[null,"APG2","ALBION PARK","Urban",1678,4.8623795852676803,5.8955896154189604,3.8951330818462293,0.1735770847402,3.2603999489480686,4,1.6723435754090001E-2,1.6723435754418838E-2,2.3053621521812169E-3,2.3053621521812169E-3,9,0.31412607927277297,0.31412607927277297,9.7513541271172322E-4,"0.00097513541271"]
[null,"APH2","ALBION PARK","Urban",2035,6.0608520810923201,5.3425421238614099,4.4279429716988856,4.26608388965,9.8852043442483151,2,0.411019576454,0.41101957645799131,2.8188788401078383E-3,2.8188788401078383E-3,24,0.95239864191224877,0.95239864191224877,3.199919148436369E-3,"0.0031999191484"]
[null,"AZ1205","ANZAC VILLAGE","Urban",1119,6.7308368334411597,2.82356722801793,3.5931805076408083,2.5417241940561,0.9412428278087509,5,0.24488463629459001,0.24488463629087986,2.6577220071946966E-3,2.6577220071946966E-3,1,9.0684861910445974E-2,9.0684861910445974E-2,2.1851773954324329E-4,"0.00021851773954"]
[null,"AZ1227","ANZAC VILLAGE","Urban",932,3.9197286642022098,5.8623900000000004,3.9552261227346026,1.044980814209,0.8732011776057087,2,0.1006795887689,0.10067958876909247,1.3193008524905899E-3,1.3193008524905899E-3,1,8.4129329724148674E-2,8.4129329724148674E-2,1.5023094593597978E-4,"0.00015023094594"]
[null,"AZ1231","ANZAC VILLAGE","Urban",37,0.25926087939543202,2.9255550128228101,2.7877399317040461,0,0,0,0,0,0,0,0,0,0,0,"0"]
[null,"AZ1250","ANZAC VILLAGE","Urban",2,1.0330135701972498,1.0275699999999999,0.55827554005603186,0,0,0,0,0,0,0,0,0,0,0,"0"]
[null,"AZ1253","ANZAC VILLAGE","Urban",1373,0,7.1451799999999999,4.2858940786035804,1.492901997353,0.43660058880285435,2,0.14383494617000001,0.14383494617376308,1.8942756546621784E-3,1.8942756546621784E-3,1,4.2064664862074337E-2,4.2064664862074337E-2,1.5023094593597978E-4,"0.00015023094594"]
[null,"AZ1257","ANZAC VILLAGE","Urban",998,1.37922045615069,4.39269,3.4432800550296934,0,-0.45361100135361487,0,0,0,0,0,1,-4.3703547908648659E-2,-4.3703547908648659E-2,4.3703547908648659E-5,"4.3703547909e-05"]
[null,"AZ1264","ANZAC VILLAGE","Urban",13,0.45177999999999996,1.2670899999999998,1.2194660172611635,1.5075306078999999E-2,0,1,1.4524435243E-3,1.4524435243301723E-3,1.9120302208736341E-5,1.9120302208736341E-5,0,0,0,0,"0"]
[null,"AZ1272","ANZAC VILLAGE","Short rural",1397,9.6894782376286699,5.7659229443275501,3.8638284574304387,4.507759326E-2,0.40839165465617644,1,1.1240323777999999E-2,1.1240323777879891E-2,1.0604079035735746E-4,1.0604079035735746E-4,1,0.10183450567318228,0.10183450567318228,2.3682443179809834E-4,"0.0002368244318"]
[null,"AZ1290","ANZAC VILLAGE","Urban",616,3.7841349672018798E-2,3.2480925686842701,1.8871940625044366,0.79300420644400005,1.3303560149073987,3,7.6402682529600002E-2,7.6402682529249158E-2,9.4782069526717894E-4,9.4782069526717894E-4,3,0.12817431160083365,0.12817431160083365,3.1002204297697644E-4,"0.00031002204298"]
[null,"AZ1294","ANZAC VILLAGE","Urban",1,7.2238632137997305E-2,0.11527,0,0,0,0,0,0,0,0,0,0,0,0,"0"]
[null,"B201","PROSPECT","Urban",952,4.4959672024256996,2.1971260600880402,2.7382236013370576,4.8148539738137002,0.2947053974419267,6,0.46389130928456995,0.46389130927635119,2.558023288528092E-3,2.558023288528092E-3,1,2.8393648781900177E-2,2.8393648781900177E-2,1.0516166215518583E-4,"0.00010516166216"]
[null,"B202","PROSPECT","Urban",57,1.73731192999438,0.94463979614986793,3.9692831006786711,0,8.2500500871188709E-2,0,0,0,0,0,2,7.9485827758854748E-3,7.9485827758854748E-3,1.9120302210033789E-5,"1.912030221e-05"]
[null,"B204","PROSPECT","Urban",78,0.46723107062880803,0.9718757088214639,2.786774602053955,1.2247497037E-2,0.22503358270276988,1,1.1799957935E-3,1.1799957935335137E-3,1.2291622849307435E-5,1.2291622849307435E-5,1,2.1681056970306169E-2,2.1681056970306169E-2,3.4143396803631763E-5,"3.4143396804e-05"]
[null,"B205","PROSPECT","Urban",662,2.9134830316800699,1.48148731601852,1.7528354172597038,0,0,0,0,0,0,0,0,0,0,0,"0"]
[null,"B207","PROSPECT","Urban",59,3.52645413518198,0.97065999999999997,1.6656921883541644,3.5920321170000005E-2,2.041249506091267E-2,3,3.4607747000599998E-3,3.4607747000161156E-3,2.5948981570760141E-5,2.5948981570760141E-5,1,1.9666596558891897E-3,1.9666596558891897E-3,8.194415232871624E-6,"8.1944152329e-06"]
[null,"B210","PROSPECT","Urban",923,5.3196967797935804,0.93382212050720104,3.1658036681363049,1.156197741111,1.0705219631945311,2,0.11139488067419999,0.11139488067565685,1.291986135049426E-3,1.291986135049426E-3,3,0.10314037306441083,0.10314037306441083,2.4856392873043927E-4,"0.00024856392873"]
[null,"B211","PROSPECT","Urban",1140,6.4010382924841398,1.8352975735118799,3.8768775550095813,0.152668452639,0.31044002905138018,2,1.47089753425E-2,1.4708975343004565E-2,1.570596252967061E-4,1.570596252967061E-4,4,2.9909615599981426E-2,2.9909615599981426E-2,6.4189585990827712E-5,"6.4189585991e-05"]
[null,"B212","PROSPECT","Urban",164,2.13946263473931,0.72253000000000001,1.4133175477894593,0.19648444031000001,0.46693582451837734,1,1.8930464923999999E-2,1.8930464923805596E-2,2.280778906482602E-4,2.280778906482602E-4,1,4.4987339628465212E-2,4.4987339628465212E-2,8.3309888200861504E-5,"8.3309888201e-05"]
[null,"B214","PROSPECT","Urban",1439,5.1041304575275799,1.5819732942657099,3.9792310767569283,0.10991561576599999,1.1150325427023546,4,1.058991595259E-2,1.058991595261443E-2,9.28700393058784E-5,9.28700393058784E-5,4,0.10742878370294698,0.10742878370294698,2.704157026847636E-4,"0.00027041570268"]
[null,"B215","PROSPECT","Urban",652,3.4069763645939402,1.28908,3.4872990870735721,4.7770908580000004E-3,1.1647029473505754,2,4.6025298891000003E-4,4.6025298891295621E-4,2.5948981570760141E-5,2.5948981570760141E-5,3,0.11221432219894402,0.11221432219894402,2.5266113634687503E-4,"0.00025266113635"]
[null,"B217","PROSPECT","Urban",2161,8.1365215059992089,3.1734531938199497,4.0403351734367137,0,2.1022743611171206,0,0,0,0,0,5,0.20254545851850436,0.20254545851850436,4.4659563019150346E-4,"0.00044659563019"]
[null,"B709","QUAKERS HILL","Urban",426,0.27006000000000002,3.5632100000000002,4.3218919833576059,0.27342820641019999,0.30363586403107595,2,2.63436792378E-2,2.6343679237810124E-2,8.2490446677574338E-4,8.2490446677574338E-4,1,2.9254062381351698E-2,2.9254062381351698E-2,6.9652529479408807E-5,"6.9652529479e-05"]
[null,"B710","QUAKERS HILL","Urban",1120,0.32414130736299096,5.4134801597958102,3.4675657167528917,0.23929397855450002,0.65319984194920544,4,2.3054987257689001E-2,2.3054987257684314E-2,9.4235775178023681E-5,9.4235775178023681E-5,1,6.293310898845407E-2,6.293310898845407E-2,1.3111064372594598E-4,"0.00013111064373"]
[null,"B712","QUAKERS HILL","Short rural",1096,0.74087121229345909,13.1384823158029,3.9819848066008485,0,4.1462880592478865E-2,0,0,0,0,0,1,1.0338977059842352E-2,1.0338977059842352E-2,3.181223710720724E-5,"3.1812237107e-05"]
[null,"B713","QUAKERS HILL","Urban",1524,0,6.3156672060277899,4.1912479520098191,2.5090358512E-3,0.17279744082814266,1,2.4173524936999999E-4,2.417352493697129E-4,1.3657358721452706E-6,1.3657358721452706E-6,1,1.664832028145085E-2,1.664832028145085E-2,6.2823850118682445E-5,"6.2823850119e-05"]
[null,"B715","QUAKERS HILL","Urban",555,2.0748883856545199,2.7241329724197598,1.60779209699324,0.14314262160999999,1.9857530351444108,1,1.3791200837000001E-2,1.3791200836922942E-2,3.6874868547922304E-5,3.6874868547922304E-5,3,0.19131910964947024,0.19131910964947024,5.2717404664807445E-4,"0.00052717404665"]
[null,"B716","QUAKERS HILL","Urban",1128,1.9795918490328899,4.7053872131928003,3.2770401279203156,2.0426670404200001E-2,0,2,1.9680253917200002E-3,1.9680253917613352E-3,3.5509132675777037E-5,3.5509132675777037E-5,0,0,0,0,"0"]
[null,"B718","QUAKERS HILL","Urban",460,0,5.2939845338059701,2.5737365096449207,0,6.6340608947966173E-2,0,0,0,0,0,2,6.391643881639866E-3,6.391643881639866E-3,2.458324569861487E-5,"2.4583245699e-05"]
[null,"B719","QUAKERS HILL","Short rural",1074,0,14.336013076118499,3.4680566376867903,1.2899562850999999E-3,3.0618742591369007E-2,1,3.2165706407999997E-4,3.2165706408398431E-4,3.5346930119119156E-6,3.5346930119119156E-6,1,7.634936905729737E-3,7.634936905729737E-3,1.4138772047647663E-5,"1.4138772048e-05"]
[null,"B720","QUAKERS HILL","Urban",1075,4.0689999999999997E-2,6.0391691226956699,3.512642800900081,4.6041516637600005E-2,0,2,4.4359101127199995E-3,4.4359101127278387E-3,2.0486038082179059E-5,2.0486038082179059E-5,0,0,0,0,"0"]
[null,"B743","MOOREBANK","Urban",776,4.8312733636775702,2.0512260953625301,2.4351304139398198,0.65294468576599995,0.8937129000731675,6,6.2908525742309998E-2,6.2908525742755461E-2,3.1821645820984807E-4,3.1821645820984807E-4,2,8.6105549531142869E-2,8.6105549531142869E-2,1.8300860686746627E-4,"0.00018300860687"]
[null,"B745","MOOREBANK","Urban",382,1.8474860090754901,2.06766975418198,2.2786962038023462,6.4611217004799992E-2,6.5915348634197166E-2,3,6.22502410528E-3,6.2250241052381437E-3,5.4629434885810822E-5,5.4629434885810822E-5,1,6.3506718054755079E-3,6.3506718054755079E-3,4.2337812036503386E-5,"4.2337812037e-05"]
[null,"B746","MOOREBANK","Urban",51,1.4082294055602298,1.46488189925093,0.8287710693746011,1.4175343792E-3,3.5580112918674169E-2,1,1.3657358720999999E-4,1.3657358721452705E-4,1.3657358721452706E-6,1.3657358721452706E-6,2,3.4279970390846291E-3,3.4279970390846291E-3,5.4629434885810824E-6,"5.4629434886e-06"]
[null,"B747","MOOREBANK","Urban",627,4.0669757368279402,0.67870000000000008,2.7066928865558459,3.0902249467000001E-2,0,2,2.9773042013000002E-3,2.9773042012766898E-3,2.7314717442905411E-5,2.7314717442905411E-5,0,0,0,0,"0"]
[null,"B748","SEVEN HILLS","Urban",1070,5.8072633672171898,1.4409978725742001,3.4993199815583278,0.27738312732827997,1.3276626995868617,3,2.6724719546529999E-2,2.6724719546138653E-2,9.2870039305878387E-5,9.2870039305878387E-5,3,0.12791482178512603,0.12791482178512603,2.7724438204548992E-4,"0.00027724438205"]
[null,"B773","LENNOX","Urban",994,1.23817237731073,2.9366529055239199,1.9562456165797375,0.15643909409300003,0,6,1.5072261085E-2,1.5072261084995205E-2,1.7208271989030408E-4,1.7208271989030408E-4,0,0,0,0,"0"]
[null,"B775","LENNOX","Urban",378,0,2.3485161715982401,3.3974523000625036,0,0,0,0,0,0,0,0,0,0,0,"0"]
[null,"B776","LENNOX","Urban",1557,4.7510360824606499,1.4208352798761901,2.2291493893411447,0.11009989523480002,0.1885320724375962,4,1.060767051897E-2,1.0607670518952316E-2,4.7800755525084474E-5,4.7800755525084474E-5,2,1.8164287099532099E-2,1.8164287099532099E-2,4.5069283780793926E-5,"4.5069283781e-05"]
[null,"B778","LENNOX","Urban",1465,0,2.76613221916159,1.1812586507619742,0.12608968303000001,0,1,1.2148220583E-2,1.2148220582732181E-2,2.5948981570760141E-5,2.5948981570760141E-5,0,0,0,0,"0"]
[null,"B798","CASTLE HILL","Urban",7,0,2.0937600000000001,2.38534353723669,3.8591509124399999E-3,1.1070943501786664E-2,2,3.71813263531E-4,3.718132635331587E-4,5.7008765672174216E-6,5.7008765672174216E-6,2,1.0666397161454564E-3,1.0666397161454564E-3,6.8286793607263528E-6,"6.8286793607e-06"]
[null,"BDA2","BOMADERRY","Urban",1851,13.3422578708982,3.2103514698316697,4.1667088912534735,0.49293340503400002,7.1305381357781492,8,4.7492099217690001E-2,4.7492099217979637E-2,5.4492861298596296E-4,5.4492861298596296E-4,15,0.68699792135000259,0.68699792135000259,1.6429802541907605E-3,"0.0016429802542"]
[null,"BDB2","BOMADERRY","Urban",164,3.7692842732286498,0.53703999999999996,1.6295780629909495,4.8904936082999999E-3,2.3814577571064782E-2,1,4.7117887589000001E-4,4.7117887589011835E-4,6.8286793607263528E-6,6.8286793607263528E-6,1,2.2944362652040544E-3,2.2944362652040544E-3,9.5601511050168944E-6,"9.560151105e-06"]
[null,"BDC2","BOMADERRY","Short rural",544,28.8450301222937,1.17235,1.6295780629909495,0.66241381542110001,1.6418450193994092,7,0.16517620444726999,0.1651762044466438,2.4071259411120143E-3,2.4071259411120143E-3,11,0.40940228341168572,0.40940228341168572,1.1735180799547558E-3,"0.00117351808"]
[null,"BDD2","BOMADERRY","Urban",711,3.0250034630416001,2.9820100000000003,2.6616780407676819,0.66136483996999995,0.13686294431466101,1,6.3719772851000001E-2,6.371977285080975E-2,9.9562145079390234E-4,9.9562145079390234E-4,3,1.3186179845562588E-2,1.3186179845562588E-2,3.0046189187195952E-5,"3.0046189187e-05"]
[null,"BDE2","BOMADERRY","Urban",1300,9.0223943497347694,1.9822899999999999,3.1867360794960495,3.990940466648,2.7009700061849307,5,0.38451064317770001,0.38451064317965167,3.7653337995045108E-3,3.7653337995045108E-3,8,0.26022731307855984,0.26022731307855984,7.6344635252920622E-4,"0.00076344635253"]
[null,"BDF2","BOMADERRY","Short rural",1726,54.6188901693152,5.3602218744887296,4.6192141506691051,9.0394041061935013,3.3915360543706403,9,2.2540207132866699,2.2540207133010495,1.2378494927715526E-2,1.2378494927715526E-2,14,0.84569651125799727,0.84569651125799727,2.1879749743734756E-3,"0.0021879749744"]
[null,"BDG2","BOMADERRY","Short rural",1577,28.449733548071901,7.0084399999999993,3.6327691846590211,2.1852426483629999,1.6775101843808371,7,0.5449012053283,0.54490120533031705,1.1858895054964477E-2,1.1858895054964477E-2,8,0.41829557102965609,0.41829557102965609,1.1134282987522533E-3,"0.0011134282988"]
[null,"BGA2","BOLONG","Short rural",762,34.924937499505802,0.522137798192575,1.3625018329066274,2.6605417283060002,0.23531070695218773,6,0.66341941280529992,0.66341941280246952,8.6558591563534338E-3,8.6558591563534338E-3,2,5.8675903997737797E-2,5.8675903997737797E-2,1.5906118553603619E-4,"0.00015906118554"]
[null,"BGB2","BOLONG","Urban",26,4.7677043254523594,9.1653098630885096E-2,1.6451217756132068,1.1000264160320001E-2,3.4134227851859524E-2,2,1.0598300533690001E-3,1.0598300533343717E-3,3.8473989663093449E-5,3.8473989663093449E-5,4,3.2886919801258115E-3,3.2886919801258115E-3,9.5601511050168944E-6,"9.560151105e-06"]
[null,"BJ1255","BERRIMA JUNCTION","Urban",2,0,0.42325999999999997,1.3950537648439689,2.8350687584999999E-4,0,1,2.7314717443000001E-5,2.7314717442905411E-5,2.7314717442905412E-6,2.7314717442905412E-6,0,0,0,0,"0"]
[null,"BK1236","BLACKHEATH","Short rural",971,8.5905299821811703,0.45143918537267003,1.1622060918787167,3.7998738219372998,0.31129054967891823,7,0.94751757991435004,0.94751757991326768,3.0497309087641122E-3,3.0497309087641122E-3,5,7.7621858541585667E-2,7.7621858541585667E-2,1.6613057155986003E-4,"0.00016613057156"]
[null,"BK1251","BLACKHEATH","Short rural",947,78.360252061322896,0.36248000000000002,0.93357538527962491,2.0381479541470999,2.1619525584827053,24,0.50822240620907,0.50822240620668024,8.1934184016065059E-3,8.1934184016065059E-3,11,0.53909370471174578,0.53909370471174578,1.4103425117528543E-3,"0.0014103425118"]
[null,"BK1288","BLACKHEATH","Short rural",1443,13.1463456303921,0.26762999999999998,1.2574688862950048,1.4618890299446998,1.8910617386118436,14,0.36452935562783001,0.3645293556254639,7.3804390088720801E-3,7.3804390088720801E-3,17,0.4715457212541091,0.4715457212541091,1.0568732105616628E-3,"0.0010568732106"]
[null,"BK1299","BLACKHEATH","Short rural",751,13.883788473037999,0.24245,0.85736514974659417,4.8559596225149004,1.5889142856789591,10,1.2108578666659602,1.2108578666710661,8.204022480646854E-3,8.204022480646854E-3,9,0.39620373970520661,0.39620373970520661,9.0841610406136228E-4,"0.00090841610406"]
[null,"BL1210","BULLI","Short rural",1367,6.8597646712084801,4.2337199999999999,2.6721544078122763,2.9983724575268602,3.2070297795700573,2,0.74765919810252002,0.74765919810558934,4.889179605515606E-3,4.889179605515606E-3,6,0.79968894701495175,0.79968894701495175,1.8733872963133153E-3,"0.0018733872963"]
[null,"BL1213","BULLI","Short rural",625,3.6048400000000003,2.17808,1.0940233344884978,1.3612942276668001,3.1873260516987596,2,0.33944553754722001,0.33944553754892992,2.2197765156374994E-3,2.2197765156374994E-3,8,0.79477572372839422,0.79477572372839422,2.1137464211233256E-3,"0.0021137464211"]
[null,"BL1232","BULLI","Short rural",1568,20.191749158131902,1.8419000000000001,2.9958751656271279,5.8221902056808998,14.577725101188706,6,1.4517923046738002,1.4517923046804451,1.2139904556753994E-2,1.2139904556753994E-2,25,3.6350288077480473,3.6350288077480473,9.3563324025308404E-3,"0.0093563324025"]
[null,"BL1243","BULLI","Urban",1128,8.0113997025113797,0.12684999999999999,1.9698840733136633,3.3877599608181996,7.2256405172806932,5,0.32639669079958,0.32639669080073458,3.1682270724273536E-3,3.1682270724273536E-3,15,0.69616064331622518,0.69616064331622518,2.0089974679256932E-3,"0.0020089974679"]
[null,"BL1251","BULLI","Urban",1568,5.6211977067941596,3.1875294179743001,3.1763206806398627,3.4813088317411998,3.9352171901805324,3,0.33540973842075,0.33540973842529331,2.1927025370090795E-3,2.1927025370090795E-3,8,0.37914193546624858,0.37914193546624858,9.9152424317746637E-4,"0.00099152424318"]
[null,"BWA2","BOWRAL","Short rural",1537,8.7992030177533103,1.39886,2.5196831299225391,3.4813510325921007,0.93890389608302138,6,0.86809232617825993,0.86809232618147114,5.8499169347142202E-3,5.8499169347142202E-3,4,0.23412039164398571,0.23412039164398571,5.6555088190590643E-4,"0.00056555088191"]
[null,"BWB2","BOWRAL","Urban",585,5.4708029985031796,0.909013410606894,2.8578838324886471,0,0.38556935115057267,0,0,0,0,0,1,3.7148015722351359E-2,3.7148015722351359E-2,8.7407095817297319E-5,"8.7407095817e-05"]
[null,"BWC2","BOWRAL","Short rural",454,7.0149183262966197,0.53267999999999993,0.78394420883407256,0.151817932017,0.82285035645545745,3,3.7856562157199999E-2,3.7856562157576608E-2,1.2724894842882896E-4,1.2724894842882896E-4,2,0.20518185995546287,0.20518185995546287,4.524407055247252E-4,"0.00045244070552"]
[null,"BWD2","BOWRAL","Urban",777,4.8831799981365105,0.83462999999999998,2.0151205638701821,0.72017540320000006,1.0935568968570195,4,6.9385927904200007E-2,6.9385927904488442E-2,1.1567782837060879E-3,1.1567782837060879E-3,4,0.1053596938566469,0.1053596938566469,3.0319336361625006E-4,"0.00030319336362"]
[null,"BWE2","BOWRAL","Short rural",1186,51.073088016069903,6.0103200000000001,3.326780008311546,11.824075503327339,0.47097579749918295,16,2.9483924810407705,2.9483924810732365,1.9396245333182689E-2,1.9396245333182689E-2,7,0.11744017532077339,0.11744017532077339,3.6760807323883921E-4,"0.00036760807324"]
[null,"BWF2","BOWRAL","Short rural",138,29.897565069585003,3.6151399999999998,0.62059264965139083,0.71050059572579993,1.8427946929990606E-2,16,0.17716688409536999,0.17716688409518103,1.5114638322713235E-3,1.5114638322713235E-3,3,4.5951009154854899E-3,4.5951009154854899E-3,1.7673465059559576E-5,"1.767346506e-05"]
[null,"BWG2","BOWRAL","Urban",445,3.2583800000000003,1.0307143355959498,2.5244259469138726,0,0.2404847074363774,0,0,0,0,0,1,2.3169709070944514E-2,2.3169709070944514E-2,5.3263699013665555E-5,"5.3263699014e-05"]
[null,"BWH2","BOWRAL","Short rural",1143,146.87674348524502,1.7698800000000001,2.518341829777158,4.9044450847561896,3.6103891871799672,53,1.2229479596750918,1.2229479596785529,1.0236470962492571E-2,1.0236470962492571E-2,24,0.90026863666890533,0.90026863666890533,2.4919585733979002E-3,"0.0024919585734"]
[null,"BWK2","BOWRAL","Short rural",1256,0.17171,18.477113051461501,2.553042890356525,0,3.4020825101521115E-2,0,0,0,0,0,1,8.4832632285885973E-3,8.4832632285885973E-3,7.0693860238238304E-5,"7.0693860238e-05"]
[null,"BYB2","BERRY","Short rural",777,38.277885082398406,4.3476400000000002,1.8840592814828456,0.97206002521200008,1.6949600325891589,8,0.24238803859479999,0.24238803859884769,1.4174118977766782E-3,1.4174118977766782E-3,13,0.42264677812731966,0.42264677812731966,1.2265384751334347E-3,"0.0012265384751"]
[null,"BYC2","BERRY","Short rural",410,52.452430671902,0.23547999999999999,0.92224546359704695,3.8697979786233998,0.83358109170622885,15,0.96495351878660007,0.96495351878689328,4.3052560885087129E-3,4.3052560885087129E-3,10,0.20785762256548018,0.20785762256548018,5.9736311901311366E-4,"0.00059736311901"]
[null,"BYD2","BERRY","Short rural",958,17.266765865677002,1.3565399999999999,1.9767004437968028,3.8862378872450001,1.9292642901320933,4,0.96905289239299996,0.96905289239643699,1.3162627744339555E-2,1.3162627744339555E-2,6,0.4810717189212117,0.4810717189212117,1.2053303170619632E-3,"0.0012053303171"]
[null,"BYE2","BERRY","Short rural",212,26.333502098327699,2.1839400000000002,1.0644537631016819,0.45630431666849997,0.19661201839920744,6,0.1137817680538,0.11378176805344457,1.085150754656958E-3,1.085150754656958E-3,1,4.9026192075218265E-2,4.9026192075218265E-2,1.343183344526528E-4,"0.00013431833445"]
[null,"BYF2","BERRY","Urban",469,2.7984899999999997,0.70737000000000005,1.2554975815358829,7.1727239589E-2,1.188602576984394,1,6.9106235131000003E-3,6.9106235130550692E-3,1.2564770023736489E-4,1.2564770023736489E-4,3,0.11451695287938093,0.11451695287938093,3.851375159449663E-4,"0.00038513751594"]
[null,"BYG2","BERRY","Short rural",624,27.730206036857599,1.7879200000000002,1.1911558200165311,4.5378003696405003,1.9500736948191904,15,1.1315232625568601,1.1315232625644707,1.1431766232538582E-2,1.1431766232538582E-2,8,0.48626064826269838,0.48626064826269838,1.5446608462055071E-3,"0.0015446608462"]
[null,"C808","CRANEBROOK","Urban",395,0,4.5185998448470803,1.2574688862950048,0.29304688221500003,0,3,2.8233857684699999E-2,2.8233857684859177E-2,7.7846944712280423E-5,7.7846944712280423E-5,0,0,0,0,"0"]
[null,"C809","CRANEBROOK","Urban",1,0,0.83633000000000002,5.334716487312142,0,0,0,0,0,0,0,0,0,0,0,"0"]
[null,"C811","CRANEBROOK","Urban",753,0,6.3239147548476602,3.1246196568542546,0,9.7809872166873216E-2,0,0,0,0,0,1,9.4235775178023676E-3,9.4235775178023676E-3,3.1411925059341222E-5,"3.1411925059e-05"]
[null,"C812","CRANEBROOK","Short rural",493,3.5567699661577801,8.8184230524540101,1.4479944751275813,1.3239771102099999E-2,5.6701375169201859E-3,3,3.30140327318E-3,3.3014032731257291E-3,4.2416316142942989E-5,4.2416316142942989E-5,1,1.4138772047647661E-3,1.4138772047647661E-3,3.5346930119119156E-6,"3.5346930119e-06"]
[null,"C820","CASTLE HILL","Urban",548,0.18740457465153199,1.42397,0.83553853828993441,0.25365360182000002,0,3,2.4438477695799998E-2,2.4438477696167471E-2,2.1578626779895276E-4,2.1578626779895276E-4,0,0,0,0,"0"]
[null,"C821","CASTLE HILL","Urban",533,0,0.57041999999999993,1.6687145592783448,0,0.12847114078961913,0,0,0,0,0,3,1.2377664209252588E-2,1.2377664209252588E-2,5.1897963141520282E-5,"5.1897963142e-05"]
[null,"C823","CASTLE HILL","Urban",0,0,2.6526642650020098,1.6418606126176885,0,5.358279953489576E-2,0,0,0,0,0,1,5.1624815967091231E-3,5.1624815967091231E-3,9.5601511050168944E-6,"9.560151105e-06"]
[null,"C824","CASTLE HILL","Urban",773,0.27907541298004002,6.5734836995906001,1.1449724172835145,0,0,0,0,0,0,0,0,0,0,0,"0"]
[null,"C826","CASTLE HILL","Urban",514,2.8728493440027703,0.35792891283404599,1.163054565834317,6.7785889488999997E-3,0.23155424084722812,1,6.5308906970999996E-4,6.5308906970769148E-4,6.9354591473383169E-6,6.9354591473383169E-6,1,2.2309295471492994E-2,2.2309295471492994E-2,1.352078513423818E-4,"0.00013520785134"]
[null,"C827","CASTLE HILL","Urban",352,0,2.3412899999999999,3.1598541890823526,0,1.9136714119605629E-3,0,0,0,0,0,1,1.8437434273961152E-4,1.8437434273961152E-4,1.3657358721452706E-6,"1.3657358721e-06"]
[null,"C830","CASTLE HILL","Urban",13,0.60941068351240602,0.56783000000000006,2.2271323584406981,1.1105436838E-3,0,1,1.0699630068E-4,1.0699630067620451E-4,1.1850034917251428E-5,1.1850034917251428E-5,0,0,0,0,"0"]
[null,"C832","CASTLE HILL","Urban",1054,7.2703032208482004,7.3482978270335302,1.8237922272233249,6.8454436214529002,0.24409942010341401,7,0.6595302414855202,0.65953024148941675,4.4236184898785317E-3,4.4236184898785317E-3,3,2.3517971718341558E-2,2.3517971718341558E-2,6.0092378374391904E-5,"6.0092378374e-05"]
[null,"C833","CASTLE HILL","Urban",1029,2.7084372625063602,3.5111999999999997,1.494330298331664,2.8009345306065003,8.8454145263954911E-2,3,0.26985848244518001,0.26985848244892835,1.4244625146475171E-3,1.4244625146475171E-3,1,8.5221918421864891E-3,8.5221918421864891E-3,2.185177395432433E-5,"2.1851773954e-05"]
[null,"C847","EMU PLAINS","Short rural",2,2.33691941863212,0.32625882158974401,0,0,0,0,0,0,0,0,0,0,0,0,"0"]
[null,"C848","EMU PLAINS","Urban",73,3.27541684331876,0.94901158456332402,1.3717842395945508,2.0128988184999999E-3,0,1,1.9393449384E-4,1.9393449384462843E-4,2.7314717442905412E-6,2.7314717442905412E-6,0,0,0,0,"0"]
[null,"C849","EMU PLAINS","Urban",3,0,2.2080377049894699,1.4860995928940965,0,0,0,0,0,0,0,0,0,0,0,"0"]
[null,"C851","EMU PLAINS","Urban",826,4.9628775051960901,1.35404540039336,3.6961964233519837,0.54742342656799992,0.76249174258784203,2,5.2741987910599995E-2,5.2741987910506057E-2,1.1567782837070442E-3,1.1567782837070442E-3,2,7.3462932562694108E-2,7.3462932562694108E-2,1.720827198903041E-4,"0.00017208271989"]
[null,"C852","EMU PLAINS","Urban",851,7.5383201230446106,2.60570411062456,3.0865145390877391,0.31648923794210004,1.0917849788829819,6,3.0492431911389999E-2,3.0492431911238092E-2,1.0076945559036666E-3,1.0076945559036666E-3,2,0.10518897687262874,0.10518897687262874,2.5129540047472978E-4,"0.00025129540047"]
[null,"C854","EMU PLAINS","Urban",967,4.7489336307791303,1.2955902071035099,4.7250346030478969,6.1875375652999998E-2,0.91516019523091807,2,5.9614370818999998E-3,5.9614370819141057E-3,4.2337812036503386E-5,4.2337812036503386E-5,3,8.8171907905698663E-2,8.8171907905698663E-2,2.2398068303182439E-4,"0.00022398068303"]
[null,"C855","EMU PLAINS","Short rural",764,17.339198854237019,0.55959000000000003,3.4866182756361495,2.5100951585739999,2.8143444058357496,6,0.6259048067231,0.62590480671430915,4.8896943704469977E-3,4.8896943704469977E-3,5,0.70177088119896791,0.70177088119896791,1.7850199710155172E-3,"0.001785019971"]
[null,"C857","EMU PLAINS","Urban",397,5.0379466245368203,2.2842204143465001,3.905774571067818,0.93509439152069995,3.1006438244088423,4,9.0092485447859999E-2,9.0092485448084278E-2,1.1638254808073137E-3,1.1638254808073137E-3,7,0.29873423599369575,0.29873423599369575,6.705763132233279E-4,"0.00067057631322"]
[null,"C868","EMU PLAINS","Urban",2,7.2308014319962699E-2,2.59052970992103,0,2.183002944E-3,0,1,2.1032332431E-4,2.1032332431037166E-4,2.7314717442905412E-6,2.7314717442905412E-6,0,0,0,0,"0"]
[null,"C869","EMU PLAINS","Urban",820,4.3479766615620701,2.6349044798211296,3.9248271299510757,5.9692372709500001E-2,0.91643597617222505,4,5.7511137576000005E-3,5.7511137576037345E-3,5.5995170757956096E-5,5.5995170757956096E-5,3,8.8294824134191749E-2,8.8294824134191749E-2,2.2124921128753382E-4,"0.00022124921129"]
[null,"C889","CAMBRIDGE PARK","Urban",720,0.18577000000000002,6.9803576234105806,2.8769363913719053,0.85813278715281993,0.41278601123178954,5,8.2677552491634984E-2,8.2677552492032208E-2,1.2373567001571074E-3,1.2373567001571074E-3,1,3.977022859687028E-2,3.977022859687028E-2,1.2428196436521964E-4,"0.00012428196437"]
[null,"C890","CAMBRIDGE PARK","Urban",937,0,5.58919927892555,3.5056708345194076,5.74668437339E-2,0,2,5.5366932257099998E-3,5.5366932256686449E-3,1.2851574556866292E-3,1.2851574556866292E-3,0,0,0,0,"0"]
[null,"C891","CAMBRIDGE PARK","Urban",865,9.0986380046510007,0.88749999999999996,2.9150415091384203,0.33419790524400006,2.1056906189710651,4,3.2198588920899995E-2,3.2198588921665737E-2,1.4080736841739839E-3,1.4080736841739839E-3,3,0.20287460086369136,0.20287460086369136,4.9166491397229742E-4,"0.00049166491397"]
[null,"C893","CAMBRIDGE PARK","Short rural",147,0.18018000000000001,2.5132590354890398,0.57157676649772948,1.0305474936899999E-2,0.1003614340494873,2,2.5697218196600001E-3,2.5697218196466861E-3,5.231345657596444E-4,5.231345657596444E-4,2,2.5025626524336361E-2,2.5025626524336361E-2,5.655508819059065E-5,"5.6555088191e-05"]
[null,"C896","CAMBRIDGE PARK","Urban",699,1.7739500000000001,4.9796063943102897,2.5911480081230405,0.12254584708460001,0,5,1.180678661467E-2,1.1806786614665447E-2,9.7786688444840924E-4,9.7786688444840924E-4,0,0,0,0,"0"]
[null,"C897","CAMBRIDGE PARK","Short rural",915,6.6510294820068205,0.77877379005696001,3.3913554812198616,0.20961080865600001,0.24126435134495391,3,5.2267505566999994E-2,5.2267505567058448E-2,4.4042274928214869E-3,4.4042274928214869E-3,1,6.0160475062740804E-2,6.0160475062740804E-2,1.3078364144074087E-4,"0.00013078364144"]
[null,"C899","CAMBRIDGE PARK","Urban",631,0,8.8928732911235802,3.0293568624379663,0.1915939466971,3.5721866356597173E-2,5,1.845928604785E-2,1.845928604790335E-2,9.5191790288222172E-4,9.5191790288222172E-4,1,3.4416543978060821E-3,3.4416543978060821E-3,8.194415232871624E-6,"8.1944152329e-06"]
[null,"C900","CAMBRIDGE PARK","Urban",1706,2.7218100000000001,6.5642500000000004,3.867669453301303,0.10820039916610001,0.48352097675536887,3,1.042466191206E-2,1.0424661912079894E-2,2.3558943794493533E-3,2.3558943794493533E-3,2,4.658525059887518E-2,4.658525059887518E-2,1.2701343610951017E-4,"0.00012701343611"]
[null,"CA1206","CASULA","Short rural",247,7.6239999999999988E-2,2.4956799999999997,0.724027721658004,0,0,0,0,0,0,0,0,0,0,0,"0"]
[null,"CA1210","CASULA","Urban",1195,4.0740630222332905,4.7241668633389198,3.131196600180755,1.055765430303,0,3,0.1017186420218,0.10171864202150761,1.7276558782637673E-3,1.7276558782637673E-3,0,0,0,0,"0"]
[null,"CA1213","CASULA","Urban",658,2.8961261067396897,3.8029999999999999,2.6677342141513609,0,1.4671480825030982E-2,0,0,0,0,0,1,1.4135366276703551E-3,1.4135366276703551E-3,4.097207616435812E-6,"4.0972076164e-06"]
[null,"CA1221","CASULA","Urban",606,0.18233000000000002,4.0843100000000003,2.399006762297164,0,0,0,0,0,0,0,0,0,0,0,"0"]
[null,"CA1236","CASULA","Urban",651,0.86053000000000002,4.4630700000000001,2.5044410828159331,1.5167617858000001E-3,0,1,1.4613373832000001E-4,1.4613373831954396E-4,1.3657358721452706E-6,1.3657358721452706E-6,0,0,0,0,"0"]
[null,"CA1238","CASULA","Short rural",637,0.51632,5.5834999999999999,1.3329068581079679,0,4.7629155142129564E-2,0,0,0,0,0,1,1.1876568520024037E-2,1.1876568520024037E-2,5.655508819059065E-5,"5.6555088191e-05"]
[null,"CA1251","CASULA","Urban",90,0,3.44217,3.3871994830421328,8.3110040654000003E-2,0,1,8.0073094183999993E-3,8.007309418387721E-3,2.458324569861487E-5,2.458324569861487E-5,0,0,0,0,"0"]
[null,"CA1254","CASULA","Urban",700,0.390952907575849,4.37862068755385,2.1196098774683421,0.86884934706000005,0.35381658105581965,1,8.3710048810999999E-2,8.3710048811400067E-2,1.23599096429147E-3,1.23599096429147E-3,1,3.4088767368745956E-2,3.4088767368745956E-2,6.5555321862972992E-5,"6.5555321863e-05"]
[null,"CA1265","CASULA","Urban",698,0.25610000000000005,4.6037388057838697,2.7498990094207176,0,0,0,0,0,0,0,0,0,0,0,"0"]
[null,"CA1269","CASULA","Urban",533,0.34433999999999998,2.9242656169042998,3.369112253808948,2.0412495060999999E-2,0.77397377105960541,1,1.9666596559000001E-3,1.9666596558891897E-3,1.3111064372594598E-4,1.3111064372594598E-4,1,7.4569178619131773E-2,7.4569178619131773E-2,8.8772831689442586E-5,"8.8772831689e-05"]
[null,"CA1276","CASULA","Urban",793,1.0405499999999999,3.3918200000000001,3.8613592457991679,1.6184415267982,0,3,0.15593016172835,0.15593016173044197,1.5023094593597977E-3,1.5023094593597977E-3,0,0,0,0,"0"]
[null,"CA1280","CASULA","Short rural",396,0,4.5533999999999999,1.0278017204926639,0,0,0,0,0,0,0,0,0,0,0,"0"]
[null,"CA1284","CASULA","Urban",1395,3.7540258187927202,5.3752501109778503,3.9339317127560944,0.20137493391074998,1.4765463354373933,7,1.9401643799588999E-2,1.9401643799695716E-2,1.7754566337888517E-4,1.7754566337888517E-4,7,0.14225914565026782,0.14225914565026782,8.0168695694927386E-4,"0.00080168695695"]
[null,"CD1204","CAWDOR","Urban",318,3.4397099999999998,2.3786999999999998,2.4768326548234945,0,6.1237485182738013E-2,0,0,0,0,0,2,5.8999789676675686E-3,5.8999789676675686E-3,9.5601511050168944E-6,"9.560151105e-06"]
[null,"CD1230","CAWDOR","Short rural",261,33.691767271558604,5.7158299999999995,2.3244121837574334,0.30983048926974005,3.4020825101521115E-2,7,7.7257785161670006E-2,7.7257785161358741E-2,1.1098936057403414E-3,1.1098936057403414E-3,1,8.4832632285885973E-3,8.4832632285885973E-3,3.5346930119119152E-5,"3.5346930119e-05"]
[null,"CD1234","CAWDOR","Short rural",514,65.502285631562302,1.1670099999999999,2.3244121837574334,0.36786434674907997,0.23318440538334265,11,9.1728818352999009E-2,9.172881835212611E-2,9.6850588526386464E-4,9.6850588526386464E-4,7,5.8145700045951008E-2,5.8145700045951008E-2,2.1561627372662683E-4,"0.00021561627373"]
[null,"CD1241","CAWDOR","Urban",749,2.3962415919741904,5.2596000000000007,4.3439834253827438,0,4.3943565756131443E-3,0,0,0,0,0,1,4.2337812036503388E-4,4.2337812036503388E-4,1.3657358721452706E-6,"1.3657358721e-06"]
[null,"CD1260","CAWDOR","Urban",1376,7.9413159502250101,2.4229184234701,3.6961964233519837,0.34762195581999999,0,5,3.3491940792979999E-2,3.3491940792618469E-2,2.4036951349756762E-4,2.4036951349756762E-4,0,0,0,0,"0"]
[null,"CD1267","CAWDOR","Urban",1141,5.6557246642161001,8.4875699999999998,5.10608578071305,2.1277191032000001E-2,0,2,2.0499695441100001E-3,2.0499695440900512E-3,4.7800755525084467E-5,4.7800755525084467E-5,0,0,0,0,"0"]
[null,"CD1271","CAWDOR","Short rural",743,15.7592775090695,5.23522,3.905774571067818,1.5266845264699999E-2,0.22436734154453178,2,3.8068643738000001E-3,3.8068643738291331E-3,2.1208158071471491E-5,2.1208158071471491E-5,4,5.5947120992541795E-2,5.5947120992541795E-2,2.0501219469089109E-4,"0.00020501219469"]
[null,"CJ1204","CHERITON AVENUE","Urban",1029,5.6257736374483498,3.97995238472499,3.7591867233612124,0.69501600722182,0.8786586849657444,4,6.6961923936135009E-2,6.6961923935679346E-2,1.4728381923326509E-3,1.4728381923326509E-3,2,8.4655138034924596E-2,8.4655138034924596E-2,1.8983728622819262E-4,"0.00018983728623"]
[null,"CJ1212","CHERITON AVENUE","Short rural",1,0,1.4366199999999998,0.17192012999777934,0,0,0,0,0,0,0,0,0,0,0,"0"]
[null,"CJ1241","CHERITON AVENUE","Urban",1233,4.0214742896055196,7.3063858784815698,4.6297718086316086,7.8814911485E-2,1.3769928959840672,2,7.5934914490999993E-3,7.5934914491277046E-3,8.1944152328716237E-5,8.1944152328716237E-5,4,0.1326675826201916,0.1326675826201916,3.9742913879427374E-4,"0.00039742913879"]
[null,"CJ1245","CHERITON AVENUE","Urban",1142,3.5066892486047802E-2,9.6271359524250801,5.4413193647757456,0.31793878591540004,0.61698183855987776,5,3.0632089876309998E-2,3.0632089876346275E-2,1.625225687852872E-3,1.625225687852872E-3,2,5.94436538351229E-2,5.94436538351229E-2,1.3247637959809124E-4,"0.0001324763796"]
[null,"CJ1249","CHERITON AVENUE","Urban",696,0.32880000000000004,5.0159799999999999,4.4537261645503081,0.277397302673,1.7367631214326531,3,2.67260852821E-2,2.67260852820108E-2,1.1199034151591219E-4,1.1199034151591219E-4,5,0.16732995905523856,0.16732995905523856,3.2504513757057439E-4,"0.00032504513757"]
[null,"CJ1253","CHERITON AVENUE","Urban",244,0.90325784113785701,5.6802394217998398,2.5111679062723025,0.26149256693200001,1.0285629455693217,4,2.5193729633749998E-2,2.5193729633463811E-2,1.1199034151591218E-4,1.1199034151591218E-4,2,9.9097794882860829E-2,9.9097794882860829E-2,1.6115683291314194E-4,"0.00016115683291"]
[null,"CJ1267","CHERITON AVENUE","Urban",1310,1.8908762358248201,3.5383875926108299,3.878267756722769,0.32910618220900001,1.5309371295684503E-2,2,3.1708022420600002E-2,3.1708022420772183E-2,2.0611933690729931E-4,2.0611933690729931E-4,1,1.4749947419168922E-3,1.4749947419168922E-3,2.7314717442905412E-6,"2.7314717443e-06"]
[null,"CJ1275","CHERITON AVENUE","Urban",1258,7.5999065941045902,0.73375000000000001,4.929420293382754,3.6834500080759995,1.3668575251725723,7,0.35488520651509997,0.35488520651665767,3.8808464264767288E-3,3.8808464264767288E-3,3,0.13169108147160771,0.13169108147160771,3.1138777884912169E-4,"0.00031138777885"]
[null,"CJ1286","CHERITON AVENUE","Urban",224,0,3.4845418389053,2.5720954492397827,2.85833441599E-2,0.2160322393946591,3,2.7538872451899998E-3,2.7538872451561337E-3,3.4573483050584399E-4,3.4573483050584399E-4,2,2.0813814691493925E-2,2.0813814691493925E-2,3.9606340292212845E-5,"3.9606340292e-05"]
[null,"CLA2","CULBURRA","Short rural",1325,48.491215182402797,2.1328100000000001,2.3169562823811249,0.82981435194524988,0.1493372468518854,14,0.20691836712843001,0.20691836712836667,2.466225547724011E-3,2.466225547724011E-3,3,3.7237990880492032E-2,3.7237990880492032E-2,1.131101763811813E-4,"0.00011311017638"]
[null,"CLB2","CULBURRA","Short rural",2131,26.6845161283305,0.89975000000000005,2.9525534572383765,1.8279814587553,3.7227287867339482,6,0.45581633734350002,0.45581633735110105,5.7368067583330393E-3,5.7368067583330393E-3,5,0.92828107878830723,0.92828107878830723,2.5308401965289315E-3,"0.0025308401965"]
[null,"CLC2","CULBURRA","Short rural",2368,18.516755998918299,0.51023000000000007,3.2488423407730944,1.9270490348230001,4.4661263412335614,6,0.48051933390580004,0.48051933390705504,6.7911354504689471E-3,6.7911354504689471E-3,8,1.1136509844120037,1.1136509844120037,3.5417623979357394E-3,"0.0035417623979"]
[null,"CLD2","CULBURRA","Short rural",964,8.9632853107218402,1.9895932110988499,1.595918542297194,4.4056968506000001E-2,0.32766307175902526,1,1.0985825881E-2,1.0985825881022234E-2,3.9235092432222263E-4,3.9235092432222263E-4,1,8.1704428970343926E-2,8.1704428970343926E-2,2.3682443179809834E-4,"0.0002368244318"]
[null,"CN1206","CHIPPING NORTON","Urban",298,3.1667886298366104,0.56647000000000003,1.6877315533850195,0,0,0,0,0,0,0,0,0,0,0,"0"]
[null,"CN1210","CHIPPING NORTON","Urban",651,2.8459999999999999E-2,6.6152294779126297,3.1246196568542546,0,3.2745044160214072E-2,0,0,0,0,0,3,3.1548498646555749E-3,3.1548498646555749E-3,1.2291622849307435E-5,"1.2291622849e-05"]
[null,"CN1213","CHIPPING NORTON","Urban",246,2.8177220217101198,1.0310571754433899,2.2735240691508509,1.80412976375,0,6,0.17382045701790003,0.17382045701792515,6.2416133581555747E-4,6.2416133581555747E-4,0,0,0,0,"0"]
[null,"CN1217","CHIPPING NORTON","Urban",688,0,5.7606599999999997,2.8738778205858528,0,0,0,0,0,0,0,0,0,0,0,"0"]
[null,"CN1221","CHIPPING NORTON","Urban",522,0,6.9502635994661697,2.397553687139661,0.95229959596845992,5.9536443927661956E-2,4,9.1750135890550005E-2,9.1750135890719273E-2,1.4627031190675849E-3,1.4627031190675849E-3,1,5.7360906630101365E-3,5.7360906630101365E-3,1.3657358721452706E-5,"1.3657358721e-05"]
[null,"CN1239","CHIPPING NORTON","Urban",340,2.1914425802750404,0.96072000000000002,1.4624826759877059,4.5531204260999998E-2,0,1,4.3867436213000004E-3,4.3867436213306087E-3,6.0092378374391904E-5,6.0092378374391904E-5,0,0,0,0,"0"]
[null,"CN1243","CHIPPING NORTON","Urban",205,1.84620885513083,1.3375743721901499,3.2811554806390992,1.020624753E-3,0,1,9.8332982793999997E-5,9.8332982794459482E-5,4.097207616435812E-6,4.097207616435812E-6,0,0,0,0,"0"]
[null,"CN1247","CHIPPING NORTON","Urban",509,6.0560000000000003E-2,6.94015,2.4870956332086154,0,0,0,0,0,0,0,0,0,0,0,"0"]
[null,"CN1254","CHIPPING NORTON","Urban",11,0.16266999999999998,0.81226999999999994,1.9550465755406718,0,1.708128926972206E-2,0,0,0,0,0,2,1.645711725935051E-3,1.645711725935051E-3,2.7314717442905412E-6,"2.7314717443e-06"]
[null,"CN1258","CHIPPING NORTON","Urban",870,0,4.1196851595046802,3.2616456603426434,0.5994752889785,0.30150956246223093,2,5.7756970032840006E-2,5.7756970033023498E-2,1.190921680510676E-3,1.190921680510676E-3,2,2.9049202000529906E-2,2.9049202000529906E-2,1.3930505895881761E-4,"0.00013930505896"]
[null,"CN1261","CHIPPING NORTON","Urban",230,1.13903772752071,0.59959929100744291,1.8343194010916202,0.98828538522780007,5.7835402672585898E-2,4,9.5217218171470011E-2,9.5217218171671086E-2,4.0833498352587662E-4,4.0833498352587662E-4,1,5.5722023583527043E-3,5.5722023583527043E-3,1.0925886977162165E-5,"1.0925886977e-05"]
[null,"CR1210","CORRIMAL","Urban",1642,6.4465782205027402,2.0089559706224298,3.6195187650410232,0.21906576296899999,5.9341249443641981,2,2.1106082167699998E-2,2.1106082168133013E-2,1.5705962529670613E-4,1.5705962529670613E-4,12,0.57172844800506961,0.57172844800506961,1.3807589667388686E-3,"0.0013807589667"]
[null,"CR1214","CORRIMAL","Urban",1173,5.6794025403052899,0.79666703503229497,3.2608124284341553,2.082017794784,3.7343525686436347,3,0.20059382195699998,0.20059382195720876,2.6140184592860476E-3,2.6140184592860476E-3,4,0.3597894581579501,0.3597894581579501,8.3583035375290563E-4,"0.00083583035375"]
[null,"CR1228","CORRIMAL","Urban",1495,4.0763939458212395,1.5422494123241299,4.3358949790515116,1.227202038145,4.2214882580660404,2,0.11823585166099999,0.11823585165923252,1.9803170146106427E-3,1.9803170146106427E-3,5,0.40672297140422231,0.40672297140422231,9.546493746295442E-4,"0.00095464937463"]
[null,"CR1254","CORRIMAL","Urban",1308,5.7873618079745599,1.6083599999999998,2.4597209166051504,2.3715350164999999E-2,3.1600385148985812,1,2.2848761141000002E-3,2.2848761140990379E-3,7.2384001223699341E-5,7.2384001223699341E-5,4,0.30445666929798443,0.30445666929798443,8.4402476898577726E-4,"0.00084402476899"]
[null,"CR1262","CORRIMAL","Urban",2108,9.2190758006854185,0.43489328726686605,3.7304097384239401,5.0843130840464994,1.8707201202698924,6,0.4898525824701,0.48985258246996066,6.2359499922153058E-3,6.2359499922153058E-3,2,0.18023616304701137,0.18023616304701137,4.3430400734219607E-4,"0.00043430400734"]
[null,"CR1280","CORRIMAL","Urban",2165,7.4613293608468201,1.03579,3.1860552680586083,0.43472944342200004,2.7045705435081748,3,4.1884387726999997E-2,4.1884387726951161E-2,5.0395653682160481E-4,5.0395653682160481E-4,4,0.26057420999008474,0.26057420999008474,6.0365525548820962E-4,"0.00060365525549"]
[null,"CS1206","CLAREMONT MEADOWS","Urban",107,0,2.7642800000000003,1.1812586507619742,0,0,0,0,0,0,0,0,0,0,0,"0"]
[null,"CS1210","CLAREMONT MEADOWS","Urban",133,0,0.58617327976946398,0.55252420761447185,0,0,0,0,0,0,0,0,0,0,0,"0"]
[null,"CS1213","CLAREMONT MEADOWS","Urban",1099,2.83408842105512,3.8544399999999999,1.7909405350262191,2.9059454773999998E-3,3.7584931791219223,1,2.7997585378999998E-4,2.7997585378978048E-4,1.3657358721452706E-6,1.3657358721452706E-6,5,0.36211530634821348,0.36211530634821348,8.1124710805429074E-4,"0.00081124710805"]
[null,"CS1239","CLAREMONT MEADOWS","Short rural",730,9.8264454347320402,5.8941300000000005,4.0200899243673645,0.40161584032199998,0.25295900997360182,2,0.1001449224137,0.10014492241348839,7.8116715563253327E-4,7.8116715563253327E-4,5,6.3076596797568135E-2,6.3076596797568135E-2,2.0147750167897918E-4,"0.00020147750168"]
[null,"CS1243","CLAREMONT MEADOWS","Urban",570,4.61602913417887,3.25835117559867,3.0103043035547086,5.8232312298299997E-2,0.17095464613514361,4,5.6104429627300001E-3,5.6104429627727714E-3,3.414339680363177E-5,3.414339680363177E-5,2,1.6470774618071962E-2,1.6470774618071962E-2,1.1335607738805746E-4,"0.00011335607739"]
[null,"CS1247","CLAREMONT MEADOWS","Urban",1147,4.3722569886746596,10.8095628795457,4.6297718086316086,0,0,0,0,0,0,0,0,0,0,0,"0"]
[null,"CS1250","CLAREMONT MEADOWS","Urban",1269,3.8638352879225799,3.83812,4.0391424832506218,0.93295025169299994,2.6726901953192912,4,8.9885906425599987E-2,8.9885906425240983E-2,3.8240604420067579E-4,3.8240604420067579E-4,5,0.25750267001363003,0.25750267001363003,5.7360906630101361E-4,"0.0005736090663"]
[null,"CS1276","CLAREMONT MEADOWS","Short rural",768,6.3787414699503193,6.19282651246459,3.2770401279203156,6.0968153651119995E-2,1.1703163834923265,3,1.520271464444E-2,1.5202714644233149E-2,8.129793927397406E-5,8.129793927397406E-5,2,0.29182425506344772,0.29182425506344772,1.3962037397052065E-3,"0.0013962037397"]
[null,"CS1280","CLAREMONT MEADOWS","Short rural",941,3.3907162714514101,4.8431403530136707,1.9052558883257651,1.9346663284416001,0.23219213131788163,4,0.48241874424727998,0.48241874425110826,3.4210438400309427E-3,3.4210438400309427E-3,1,5.7898271535117174E-2,5.7898271535117174E-2,1.378530274645647E-4,"0.00013785302746"]
[null,"CS1284","CLAREMONT MEADOWS","Urban",1189,6.2336396173565802,2.4066999999999998,3.0865145390877391,5.5531443185936,3.1418231981254752,5,0.53502253703809,0.53502253703732583,3.3271631942716506E-3,3.3271631942716506E-3,7,0.30270169870227775,0.30270169870227775,6.2960423705896976E-4,"0.00062960423706"]
[null,"CT1202","CAMPBELLTOWN","Urban",286,2.30687,14.1613096756661,3.5628285111691804,1.2122790281000001E-2,0.16124453563741781,1,1.1679808122999999E-3,1.1679808122703802E-3,3.893269374234601E-4,3.893269374234601E-4,2,1.5535245545652453E-2,1.5535245545652453E-2,3.5509132675777037E-5,"3.5509132676e-05"]
[null,"CT1203","CAMPBELLTOWN","Urban",408,0,3.7680876662093903,3.0484094213212241,3.9265702305E-3,0,1,3.7830883657999999E-4,3.7830883658423998E-4,3.1411925059341222E-5,3.1411925059341222E-5,0,0,0,0,"0"]
[null,"CT1206","CAMPBELLTOWN","Short rural",1894,0,16.0845868903018,3.4485131578696349,0.35735107760100004,0,6,8.9107282002899996E-2,8.910728200266993E-2,7.1310559911577885E-3,7.1310559911577885E-3,0,0,0,0,"0"]
[null,"CT1210","CAMPBELLTOWN","Urban",216,0,3.05403,3.1944790394262053,0,0,0,0,0,0,0,0,0,0,0,"0"]
[null,"CT1225","CAMPBELLTOWN","Short rural",1302,6.6625216391341899,24.618420486684602,2.8388312736053898,0.16708477728022,0,7,4.1663426531779998E-2,4.1663426531405749E-2,3.1812237107207243E-4,3.1812237107207243E-4,0,0,0,0,"0"]
[null,"CT1228","CAMPBELLTOWN","Urban",493,0.23719999999999999,4.6077376438557103,3.3723029223366039,2.3352322330000001E-2,0.23360966569711167,1,2.2498998804999998E-3,2.2498998804800067E-3,7.4996662682666893E-4,7.4996662682666893E-4,2,2.2507327172954058E-2,2.2507327172954058E-2,8.8772831689442586E-5,"8.8772831689e-05"]
[null,"CT1229","CAMPBELLTOWN","Urban",3,0,2.3333000000000004,3.0674619802044814,0,0,0,0,0,0,0,0,0,0,0,"0"]
[null,"CT1233","CAMPBELLTOWN","Urban",826,0.28491662758816499,8.43135919352253,3.1627247746207701,0.14477278615110001,0,6,1.3948260462270001E-2,1.394826046221965E-2,7.6481208840135169E-5,7.6481208840135169E-5,0,0,0,0,"0"]
[null,"CT1236","CAMPBELLTOWN","Short rural",314,0.84540999999999999,7.9063100000000004,0.66683956091401775,4.0102047587999998E-2,7.2294253340732372E-3,1,9.9996465307000005E-3,9.9996465306988087E-3,8.129793927397406E-5,8.129793927397406E-5,1,1.8026934360750768E-3,1.8026934360750768E-3,3.5346930119119156E-6,"3.5346930119e-06"]
[null,"CT1243","CAMPBELLTOWN","Urban",290,0.57911000000000001,3.69144982910752,2.0703780653140043,1.2335470812E-2,2.2042659597027225E-2,1,1.1884717036999999E-3,1.1884717037076507E-3,3.9615723456921687E-4,3.9615723456921687E-4,2,2.1237192811858958E-3,2.1237192811858958E-3,9.5601511050168944E-6,"9.560151105e-06"]
[null,"CT1262","CAMPBELLTOWN","Short rural",418,3.9348299999999998,6.9942700000000002,2.6356039788506349,0,9.1430967460338006E-2,0,0,0,0,0,2,2.2798769926831854E-2,2.2798769926831854E-2,6.0089781202502562E-5,"6.0089781203e-05"]
[null,"CT1265","CAMPBELLTOWN","Urban",1137,1.6918909526542401,6.6771459942694502,3.6199861878189532,2.0951838078280001,3.4020825101521118E-3,3,0.20186231297330001,0.20186231297016186,3.182527289965903E-3,3.182527289965903E-3,1,3.2777660931486495E-4,3.2777660931486495E-4,1.3657358721452706E-6,"1.3657358721e-06"]
[null,"CT1266","CAMPBELLTOWN","Short rural",189,2.54390012597921,3.3636327850438201,0.46996311912035599,5.3256766628000003E-2,0.54603424287941393,2,1.327984164541E-2,1.3279841645753066E-2,6.7159167226326399E-5,6.7159167226326399E-5,2,0.13615637481884699,0.13615637481884699,4.4537131950090134E-4,"0.0004453713195"]
[null,"CT1269","CAMPBELLTOWN","Urban",88,0,1.66275,3.6136353348578742,3.6581051372000001E-3,0.1275780941307042,1,3.5244333281000002E-4,3.5244333281446211E-4,1.1748111093815402E-4,1.1748111093815402E-4,1,1.2291622849307435E-2,1.2291622849307435E-2,2.7314717442905411E-4,"0.00027314717443"]
[null,"CT1270","CAMPBELLTOWN","Urban",78,0,2.1522319883849801,3.0674619802044814,0,0,0,0,0,0,0,0,0,0,0,"0"]
[null,"CT1273","CAMPBELLTOWN","Urban",257,0.88540999999999992,1.79288,2.3942715663293841,0,0.68537787235772751,0,0,0,0,0,4,6.6033329418223832E-2,6.6033329418223832E-2,1.1335607738805746E-4,"0.00011335607739"]
[null,"CT1280","CAMPBELLTOWN","Urban",3,3.4320000000000003E-2,1.8891657258438699,2.9150415091384203,1.2760831874E-4,0,1,1.2294534866000001E-5,1.2294534865821914E-5,4.0981782886073048E-6,4.0981782886073048E-6,0,0,0,0,"0"]
[null,"CT1288","CAMPBELLTOWN","Urban",264,0,2.5571700000000002,2.934094068021678,0.11208444336500001,0.80799459616112657,2,1.0798873541000001E-2,1.0798873541052655E-2,1.5705962529670613E-4,1.5705962529670613E-4,1,7.784694471228043E-2,7.784694471228043E-2,2.0486038082179059E-4,"0.00020486038082"]
[null,"CT1296","CAMPBELLTOWN","Urban",626,7.5089199999999998,6.5003239218640205,4.4773513375655476,8.7731202730440008E-2,0.87433520510909268,8,8.4525393127289992E-3,8.4525393127070792E-3,5.8726642502246637E-5,5.8726642502246637E-5,4,8.4238588593920291E-2,8.4238588593920291E-2,2.7861011791763523E-4,"0.00027861011792"]
[null,"CV1210","CANLEY VALE","Urban",2167,1.41623653577915,2.5407462488313599,2.7525816097114806,0,0,0,0,0,0,0,0,0,0,0,"0"]
[null,"CV1213","CANLEY VALE","Urban",1112,1.6471368595235698,1.7362606081956902,3.3427943191382146,0.42389948076,0.81267245961258572,1,4.0840965521E-2,4.0840965520632169E-2,7.6481208840135156E-5,7.6481208840135156E-5,4,7.8297637550088367E-2,7.8297637550088367E-2,1.9666596558891896E-4,"0.00019666596559"]
[null,"CV1221","CANLEY VALE","Urban",1440,4.3450935024110002,2.3334617522332199,4.0650438019671205,4.3010828134962003,1.1907288785532391E-2,4,0.41439157832417001,0.41439157832631796,2.1100619224644433E-3,2.1100619224644433E-3,1,1.1472181326020272E-3,1.1472181326020272E-3,2.7314717442905412E-6,"2.7314717443e-06"]
[null,"CV1236","CANLEY VALE","Urban",1651,5.2949849591517895,1.9298428656036599,3.3091195563973468,0.1246437979654,0.64568690973928622,5,1.200891552388E-2,1.2008915523773365E-2,1.1199034151591218E-4,1.1199034151591218E-4,3,6.2209268976217078E-2,6.2209268976217078E-2,1.5296241768027031E-4,"0.00015296241768"]
[null,"CV1239","CANLEY VALE","Urban",1264,6.2249805118541799,0.33999864441960104,3.0465733897301677,0.37712084625100001,1.7010412550760558E-2,3,3.6334037142900004E-2,3.6334037142552775E-2,3.714801572235136E-4,3.714801572235136E-4,1,1.6388830465743247E-3,1.6388830465743247E-3,6.8286793607263528E-6,"6.8286793607e-06"]
[null,"CV1247","CANLEY VALE","Urban",1295,3.9588064580276301,1.56782139025311,3.8266378624903199,2.5387615472,0.43532480786154731,1,0.24459919749,0.24459919749360154,1.7768223696609971E-3,1.7768223696609971E-3,1,4.1941748633581258E-2,4.1941748633581258E-2,1.1335607738805746E-4,"0.00011335607739"]
[null,"CV1251","CANLEY VALE","Urban",630,2.80890835154801,1.6411600000000002,2.0957814771583414,9.860369141969999E-2,0,3,9.5000587266400004E-3,9.5000587266425018E-3,5.0532227269375015E-5,5.0532227269375015E-5,0,0,0,0,"0"]
[null,"CV1269","CANLEY VALE","Urban",798,3.4039429733718096,0.16347968594862999,2.1185530955356109,0.49473367369899995,0,5,4.7665547673900001E-2,4.7665547673742086E-2,3.0455909948839531E-4,3.0455909948839531E-4,0,0,0,0,"0"]
[null,"CV1276","CANLEY VALE","Urban",481,2.8536903201357502,0.25953999999999999,1.9638056719446144,5.9394690490000004E-3,0.38230902207834355,1,5.7224333043000004E-4,5.7224333042886835E-4,1.3657358721452706E-6,1.3657358721452706E-6,3,3.683389647175795E-2,3.683389647175795E-2,8.6041359945152052E-5,"8.6041359945e-05"]
[null,"CV1280","CANLEY VALE","Urban",1277,0.81724532741855893,2.8475772385227502,3.4433207004886572,3.7314182725,0,1,0.35950675083,0.35950675083241601,1.7467761804738011E-3,1.7467761804738011E-3,0,0,0,0,"0"]
[null,"CV1284","CANLEY VALE","Urban",1365,4.7530313794422998,1.05199,3.9665903390231767,0.88442804988599999,0,7,8.5210992535099991E-2,8.5210992534887717E-2,4.438641584472129E-4,4.438641584472129E-4,0,0,0,0,"0"]
[null,"CX1206","CATTAI","Short rural",682,35.5515232513333,2.0064047502795099,3.6961964233519837,0.26330701094499998,0.98376885918565227,4,6.565692269609999E-2,6.5656922696263831E-2,1.6719097946343358E-3,1.6719097946343358E-3,11,0.24530769502668692,0.24530769502668692,6.1150189106076139E-4,"0.00061150189106"]
[null,"CX1210","CATTAI","Short rural",797,56.544300967184604,2.9244299999999996,4.9727178685302462,3.4809541230202004,2.6436307405450754,16,0.86799335477890027,0.86799335477713757,6.825492206001909E-3,6.825492206001909E-3,13,0.65920257325651266,0.65920257325651266,1.7920893570393412E-3,"0.001792089357"]
[null,"CX1232","CATTAI","Short rural",776,107.43907104202499,2.1515399999999998,2.8388312736053898,12.188825288569696,2.3207022336126784,28,3.0393446679100409,3.0393446679155915,2.0907709165458976E-2,2.0907709165458976E-2,12,0.57867873175214735,0.57867873175214735,1.6224240924675691E-3,"0.0016224240925"]
[null,"CX1273","CATTAI","Short rural",428,41.467960395308999,3.7735519509568398,3.1436722157375119,2.4466643385590001E-2,0.54447495506226085,5,6.1008801385999999E-3,6.1008801385599659E-3,6.0089781202502569E-5,6.0089781202502569E-5,8,0.13576755858753667,0.13576755858753667,3.8528153829839876E-4,"0.0003852815383"]
[null,"CX1284","CATTAI","Short rural",185,20.4459646002318,0.13940694925175298,1.2574688862950048,0.34970573136200001,0.19136714119605627,3,8.7200876603999999E-2,8.7200876603866953E-2,1.0109222014068077E-3,1.0109222014068077E-3,1,4.7718355660810861E-2,4.7718355660810861E-2,8.8367325297797884E-5,"8.8367325298e-05"]
[null,"D810","WISEMANS","Short rural",210,28.741270158536,0.69207995445987502,0.91452282639636717,1.5016910497603,0.24920254386864218,5,0.37445418872449998,0.37445418872536074,1.9228729984788662E-3,1.9228729984788662E-3,3,6.2139903149411473E-2,6.2139903149411473E-2,1.6259587854794812E-4,"0.00016259587855"]
[null,"D813","WISEMANS","Short rural",304,36.205447878522698,0.89356630033279205,4.2296680720831983,0.7023315835449,0.97797114357460146,8,0.17512989996809999,0.17512989996818776,2.1844402813615636E-3,2.1844402813615636E-3,13,0.24386200558481497,0.24386200558481497,6.29175356120321E-4,"0.00062917535612"]
[null,"D814","WISEMANS","Short rural",346,68.6674768552719,0.82953125710514697,1.2765214451782625,6.9550213745109009,1.16349804312823,16,1.7342694336277,1.7342694336275679,8.0131490580035627E-3,8.0131490580035627E-3,11,0.2901240677247181,0.2901240677247181,7.0693860238238307E-4,"0.00070693860238"]
[null,"D840","CARRAMAR","Urban",669,0,2.1184512448023702,2.5422515210050478,8.9800802924000001E-2,0,1,8.6519367500000003E-3,8.6519367500402893E-3,6.9652529479408807E-5,6.9652529479408807E-5,0,0,0,0,"0"]
[null,"D841","CARRAMAR","Urban",477,0.79787075889276105,2.0681241323907202,1.8443556540260246,7.3144773967999998E-3,0,1,7.0471971002999999E-4,7.0471971002695967E-4,5.4629434885810824E-6,5.4629434885810824E-6,0,0,0,0,"0"]
[null,"D842","CARRAMAR","Urban",242,0.92980685149404996,1.2173800000000001,3.1685154823506814,0.34665803243999999,0,1,3.3399070752999999E-2,3.3399070753312596E-2,3.8104030832853048E-4,3.8104030832853048E-4,0,0,0,0,"0"]
[null,"D845","CARRAMAR","Urban",1494,4.8641345868550001,0.53501230538143607,3.5310742463637443,3.5211553979999997E-2,0.37139400735827222,1,3.3924879064000002E-3,3.3924879064088521E-3,3.1411925059341222E-5,3.1411925059341222E-5,2,3.5782279850206086E-2,3.5782279850206086E-2,1.1062460564376691E-4,"0.00011062460564"]
[null,"D847","CARRAMAR","Urban",1064,0,4.0254381008765003,3.0816878908373195,0.71681878489200002,0,3,6.90625315824E-2,6.9062531582642042E-2,2.0212890907750006E-4,2.0212890907750006E-4,0,0,0,0,"0"]
[null,"D848","CARRAMAR","Urban",510,0,2.3865299956130399,3.0423126024785816,0,0,0,0,0,0,0,0,0,0,0,"0"]
[null,"D850","CARRAMAR","Urban",1222,4.2596748391962,1.4596220011324201,3.2419630968456401,9.0353641331999995E-2,0.30002115136403934,2,8.7052004490000001E-3,8.7052004490539552E-3,9.9698718666604749E-5,9.9698718666604749E-5,1,2.8905799733954653E-2,2.8905799733954653E-2,6.9652529479408807E-5,"6.9652529479e-05"]
[null,"D851","CARRAMAR","Urban",3,0,0.94294,0.66754514067799386,0,0,0,0,0,0,0,0,0,0,0,"0"]
[null,"D852","CARRAMAR","Urban",1380,5.6745574945181501,1.2586509224481299,3.2153098371385607,1.8136501861450001,0.91062408521738192,4,0.17473771042549999,0.17473771042575448,2.1483025268845108E-3,2.1483025268845108E-3,1,8.7734872426612182E-2,8.7734872426612182E-2,1.993974373332095E-4,"0.00019939743733"]
[null,"DFA2","DARKES FOREST","Short rural",65,18.557902607955999,0.16008864300755399,0.25972448269656834,0.11574168206600001,0.16802034997013743,2,2.8860768441800001E-2,2.8860768442260789E-2,1.4492241348838854E-4,1.4492241348838854E-4,2,4.1896716270191932E-2,4.1896716270191932E-2,1.2724894842882896E-4,"0.00012724894843"]
[null,"DFC2","DARKES FOREST","Short rural",3,6.3297240002675901,4.8329999999999998E-2,1.9052558883257648E-2,0,6.8041650203042236E-3,0,0,0,0,0,1,1.6966526457177194E-3,1.6966526457177194E-3,3.5346930119119156E-6,"3.5346930119e-06"]
[null,"DP1206","DAPTO","Urban",1637,7.7920267960927303,3.3203899999999997,3.2446050516774578,5.7608597171699999E-2,2.700133660901185,4,5.5503505844399998E-3,5.5503505843983803E-3,6.5555321862972992E-5,6.5555321862972992E-5,9,0.26014673466210331,0.26014673466210331,9.2050597782591243E-4,"0.00092050597783"]
[null,"DP1210","DAPTO","Short rural",1835,31.158484036382202,3.7063699999999997,4.0258615795383932,0.1651285798364,6.4047180075809891,3,4.1175638895129998E-2,4.1175638895761903E-2,3.0751829203633669E-4,3.0751829203633669E-4,19,1.5970485313350535,1.5970485313350535,4.0790357357463501E-3,"0.0040790357357"]
[null,"DP1221","DAPTO","Short rural",1017,9.8841401951236101,4.1713900000000006,2.932884865617881,1.9142809517482999,5.7138684525194332,3,0.47733554840806997,0.47733554840762082,3.6725460393764804E-3,3.6725460393764804E-3,14,1.4247817327065144,1.4247817327065144,3.962390866353257E-3,"0.0039623908664"]
[null,"DP1236","DAPTO","Short rural",2340,15.507324057893801,11.880409999999999,5.5941666131607928,1.981599659419,8.3787763840967511,7,0.49412180551790008,0.49412180552119056,9.0240712594111192E-3,9.0240712594111192E-3,19,2.089289880173907,2.089289880173907,6.4402106677035097E-3,"0.0064402106677"]
[null,"DP1243","DAPTO","Urban",1295,2.9076371731506603,6.3387829296729397,3.8342487246788908,0.25121544268439999,2.5730375284594191,2,2.4203571126000002E-2,2.4203571126158483E-2,1.6935124814601357E-4,1.6935124814601357E-4,8,0.2479015468324488,0.2479015468324488,8.4129329724148664E-4,"0.00084129329724"]
[null,"DP1258","DAPTO","Urban",1478,9.7590988992793104,3.8579599999999998,3.5324561919680892,2.9512924021961999,4.5959016136520727,6,0.28434484284584993,0.28434484284477318,1.7399475011130748E-3,1.7399475011130748E-3,12,0.44279615299519531,0.44279615299519531,1.1117089999262502E-3,"0.0011117089999"]
[null,"DP1269","DAPTO","Urban",1342,5.92267775841463,2.5679194182347502,3.068406987125091,3.3483005041761995,5.5616252601901257,9,0.32259493499406999,0.32259493499893488,4.733882676578996E-3,4.733882676578996E-3,12,0.53583964075683621,0.53583964075683621,1.307009229643024E-3,"0.0013070092296"]
[null,"DP1273","DAPTO","Urban",224,0.86336000000000002,1.03904,2.3183560103737353,0,0,0,0,0,0,0,0,0,0,0,"0"]
[null,"DP1284","DAPTO","Short rural",1133,16.709854453994701,5.7350181351942702,3.6426968380077964,5.7594421828000002E-2,0.78722771750540632,2,1.4361457707199999E-2,1.4361457707398112E-2,7.0693860238238318E-5,7.0693860238238318E-5,8,0.19629917641652822,0.19629917641652822,1.0109222014068077E-3,"0.0010109222014"]
[null,"DP1295","DAPTO","Urban",762,6.0257260861345001,1.6708015933153599,3.0281171759399559,0.96235066634790001,1.641079550834625,2,9.2718515041080002E-2,9.2718515040789387E-2,9.3255545694878204E-4,9.3255545694878204E-4,9,0.15811124191825798,0.15811124191825798,4.0698928989929062E-4,"0.0004069892899"]
[null,"DS1204","DOONSIDE","Urban",590,3.3268199556031299,3.8667460124590103,2.0485584397955887,0.2399176936819,0.61726534543572376,2,2.311507963603E-2,2.3115079636058706E-2,1.5296241768027031E-4,1.5296241768027031E-4,3,5.9470968552565805E-2,5.9470968552565805E-2,1.2701343610951017E-4,"0.00012701343611"]
[null,"DS1205","DOONSIDE","Urban",1705,7.0623382658668898,2.2032745573804799,3.9921156872443668,4.0428080496000003E-2,3.2180865477280518,1,3.8950787073999999E-3,3.8950787073583119E-3,6.2823850118682445E-5,6.2823850118682445E-5,6,0.31004935769441933,0.31004935769441933,7.7573797537851372E-4,"0.00077573797538"]
[null,"DS1209","DOONSIDE","Urban",832,0.64258000000000004,8.4639299999999995,2.8158970733923225,0,0,0,0,0,0,0,0,0,0,0,"0"]
[null,"DS1223","DOONSIDE","Urban",1564,3.7784708684308197,8.9382855198125704,4.1294770157691012,8.3478599592900021E-2,0,5,8.042818551000001E-3,8.0428185510634988E-3,4.506928378079394E-5,4.506928378079394E-5,0,0,0,0,"0"]
[null,"DS1226","DOONSIDE","Urban",1328,3.2291777138393498,3.31483791522896,3.408182701225555,0.48588825917299999,1.6670204299745348,4,4.6813328488999995E-2,4.6813328489523444E-2,2.4856392873043927E-4,2.4856392873043927E-4,4,0.16061053856428381,0.16061053856428381,3.9333193117783793E-4,"0.00039333193118"]
[null,"DS1235","DOONSIDE","Urban",1211,1.2748218837278,6.9630454259822798,3.8338473507717445,6.0670471431000005E-3,0.23984681696572388,2,5.8453495328000002E-4,5.8453495327817585E-4,2.7314717442905412E-6,2.7314717442905412E-6,2,2.3108250956697978E-2,2.3108250956697978E-2,9.8332982794459482E-5,"9.8332982794e-05"]
[null,"DS1241","DOONSIDE","Urban",955,4.5470399155121903,2.2210300000000003,3.0687219894319546,5.9451391865000001E-2,8.3351021498726738E-2,1,5.7278962477999998E-3,5.7278962477772645E-3,5.5995170757956096E-5,5.5995170757956096E-5,1,8.0305269282141909E-3,8.0305269282141909E-3,1.9120302210033789E-5,"1.912030221e-05"]
[null,"DS1245","DOONSIDE","Short rural",666,1.9708850655515699,4.4900755040190701,1.4222417663703775,1.0489754406E-3,1.5268262798686831,1,2.6156728288000001E-4,2.6156728288148173E-4,3.5346930119119156E-6,3.5346930119119156E-6,4,0.38072178431303244,0.38072178431303244,9.1548549008518615E-4,"0.00091548549009"]
[null,"DS1256","DOONSIDE","Urban",1689,5.25168676675586,3.87563323150659,3.7088981292741616,1.278190749747,2.3835840586753232,4,0.12314840358694999,0.12314840359133905,2.4555930981171965E-3,2.4555930981171965E-3,6,0.22964848690122724,0.22964848690122724,6.0638672723250012E-4,"0.00060638672723"]
[null,"DS1257","DOONSIDE","Urban",1693,3.92847301215859,5.73679487865334,4.279275854732826,0.228251385739,1.800552168498005,3,2.1991079013400004E-2,2.1991079013283149E-2,9.6967246922314215E-5,9.6967246922314215E-5,4,0.17347577047989227,0.17347577047989227,4.2474385623717914E-4,"0.00042474385624"]
[null,"DS1271","DOONSIDE","Urban",1366,0.72385685099291397,6.8052689544081701,4.0427599290972625,1.9476922370999999E-2,0.45247697385023083,1,1.8765210883E-3,1.8765210883276019E-3,3.1411925059341222E-5,3.1411925059341222E-5,1,4.3594289038877035E-2,4.3594289038877035E-2,1.0379592628304056E-4,"0.00010379592628"]
[null,"DS1275","DOONSIDE","Urban",701,0,4.6698399999999998,2.4427615988578544,1.2927913538600001E-2,0.17223042707645064,2,1.2455511154E-3,1.2455511153964868E-3,2.7314717442905412E-6,2.7314717442905412E-6,1,1.6593690846565038E-2,1.6593690846565038E-2,6.1458114246537178E-5,"6.1458114247e-05"]
[null,"DS1286","DOONSIDE","Urban",260,0.75853834446603297,2.0899051905107298,0.81521580881445876,0,0,0,0,0,0,0,0,0,0,0,"0"]
[null,"DS1290","DOONSIDE","Urban",1488,0,7.0524569391398,4.0797676194721015,0.55930236467100003,0.57495194421570683,5,5.38864745716E-2,5.3886474571363793E-2,3.5372559088562509E-4,3.5372559088562509E-4,3,5.5394246974212177E-2,5.5394246974212177E-2,2.3080936239255073E-4,"0.00023080936239"]
[null,"ED1122","EDMONDSON PARK","Short rural",238,0,7.8887335391209898,0,2.7401807428999999E-2,1.0631507844225349E-2,1,6.8327780017999997E-3,6.8327780017915524E-3,8.5409725022394405E-4,8.5409725022394405E-4,3,2.6510197589339366E-3,2.6510197589339366E-3,1.0604079035735746E-5,"1.0604079036e-05"]
[null,"ED1242","EDMONDSON PARK","Short rural",197,0,5.3225600000000002,0,2.2949013721999999E-2,2.041249506091267E-2,1,5.7224515764999996E-3,5.7224515765070165E-3,7.1530644706337707E-4,7.1530644706337707E-4,1,5.089957937153158E-3,5.089957937153158E-3,2.1208158071471491E-5,"2.1208158071e-05"]
[null,"ER1122","EAST RICHMOND","Short rural",1040,19.529558402733699,1.80501,1.6194675050769003,1.8490034935717998,1.5717621196902756,6,0.46105828708544006,0.46105828708776642,5.9382842600120183E-3,5.9382842600120183E-3,3,0.39192676116079317,0.39192676116079317,8.6599978791841931E-4,"0.00086599978792"]
[null,"ER1132","EAST RICHMOND","Urban",12,3.6321699999999999,1.84633,3.4485131578696349,0,1.7010412550760559E-3,0,0,0,0,0,1,1.6388830465743247E-4,1.6388830465743247E-4,2.7314717442905412E-6,"2.7314717443e-06"]
[null,"ER1142","EAST RICHMOND","Urban",938,4.3141519880971604,2.4878100000000001,3.8105117766515302,0.12815928323,0.50903659558150971,1,1.2347618019999999E-2,1.2347618020065391E-2,7.2384001223699341E-5,7.2384001223699341E-5,1,4.9043575168736669E-2,4.9043575168736669E-2,1.8164287099532099E-4,"0.000181642871"]
[null,"ER1152","EAST RICHMOND","Urban",251,0.78428999999999993,2.0074900000000002,2.0005186827420531,0,0,0,0,0,0,0,0,0,0,0,"0"]
[null,"ER1222","EAST RICHMOND","Urban",1,2.1970200000000002,1.67604,5.2013485751293382,0,0,0,0,0,0,0,0,0,0,0,"0"]
[null,"ER1232","EAST RICHMOND","Short rural",1309,22.469957560506597,1.8707100000000001,5.0870332218297918,3.7912382232723005,0.55113736664464208,9,0.94536425011605008,0.94536425011487735,8.3171326570287366E-3,8.3171326570287366E-3,1,0.13742886430313528,0.13742886430313528,3.8174684528648688E-4,"0.00038174684529"]
[null,"ER1242","EAST RICHMOND","Urban",471,1.8400000000000001E-3,3.8915100000000002,3.6199861878189532,0.90496812303999996,3.2532414003329568E-2,1,8.7189943813999998E-2,8.7189943813626214E-2,8.6724227881224678E-4,8.6724227881224678E-4,1,3.1343638265733959E-3,3.1343638265733959E-3,1.2291622849307435E-5,"1.2291622849e-05"]
[null,"ER1252","EAST RICHMOND","Short rural",631,13.517838880977001,2.3720901874926801,2.1338865949248569,2.0794520576625999,0.95059855471166921,7,0.51852179137489995,0.5185217913824185,4.5314764412710757E-3,4.5314764412710757E-3,4,0.23703651337881304,0.23703651337881304,5.3373864479869921E-4,"0.0005337386448"]
[null,"ER1262","EAST RICHMOND","Short rural",611,20.015429233219201,1.2705669746382,3.0293568624379663,0.13596197272660002,0.90920655083815183,4,3.3902799249700001E-2,3.39027992494398E-2,2.7545759288176382E-3,2.7545759288176382E-3,2,0.22671520978403026,0.22671520978403026,5.1959987275105159E-4,"0.00051959987275"]
[null,"F601","DUNDAS","Urban",1492,4.5697994882960398,1.4962349502921799,3.2713294409377136,0,2.3363801638469628,0,0,0,0,0,2,0.2251005864469835,0.2251005864469835,4.6571593240153728E-4,"0.0004657159324"]
[null,"F602","DUNDAS","Urban",996,2.4633123036842197,3.2559345838809599,4.0742773070872369,0.17841087696999999,0.15139267170176898,1,1.7189151686999998E-2,1.7189151686820375E-2,7.921268058442569E-5,7.921268058442569E-5,3,1.4586059114511491E-2,1.4586059114511491E-2,1.5569388942456085E-4,"0.00015569388942"]
[null,"F603","DUNDAS","Urban",1525,0.71430678393870406,5.2745683017157701,2.5468749419607244,0,0,0,0,0,0,0,0,0,0,0,"0"]
[null,"FF1202","FAIRFIELD","Urban",615,0.18024513513907101,2.2122148590738999,1.3637364387222628,0,0,0,0,0,0,0,0,0,0,0,"0"]
[null,"FF1206","FAIRFIELD","Urban",1521,4.0674905100718304,2.11586659444523,3.8755241882435802,0.15089653467,1.5625481462252804,3,1.4538258359E-2,1.4538258358986405E-2,2.3354083413684127E-4,2.3354083413684127E-4,6,0.15054506518657318,0.15054506518657318,3.2094792995413857E-4,"0.00032094792995"]
[null,"FF1210","FAIRFIELD","Urban",2,0,0.92295000000000005,0.41458368129968648,0,0,0,0,0,0,0,0,0,0,0,"0"]
[null,"FF1217","FAIRFIELD","Urban",473,2.7105664847479303,1.8284321371572301,2.6822548043616004,0,0,0,0,0,0,0,0,0,0,0,"0"]
[null,"FF1232","FAIRFIELD","Urban",471,2.9609233984057499,0.45485999999999999,1.616246352455037,0.626621072339,1.9383365101591656,3,6.0372354228200004E-2,6.0372354228181685E-2,3.7694310071209472E-4,3.7694310071209472E-4,2,0.1867507231571443,0.1867507231571443,4.0152634641070956E-4,"0.00040152634641"]
[null,"FF1239","FAIRFIELD","Urban",1666,5.0566245636463796,1.7002699999999999,4.0995314738869952,1.9770635493966,0,2,0.19048191356159,0.19048191355984517,2.2862418499711833E-3,2.2862418499711833E-3,0,0,0,0,"0"]
[null,"FF1243","FAIRFIELD","Urban",107,1.3009768325606699,2.3569553876849301,3.7502142382977963,7.5795563257300011E-2,0.1343822591510084,3,7.3025897083199998E-3,7.3025897083607615E-3,6.1458114246537178E-5,6.1458114246537178E-5,2,1.2947176067937166E-2,1.2947176067937166E-2,2.5948981570760141E-5,"2.5948981571e-05"]
[null,"FF1247","FAIRFIELD","Urban",212,0,1.54017,2.2577333083484068,0,0,0,0,0,0,0,0,0,0,0,"0"]
[null,"FF1265","FAIRFIELD","Urban",392,3.3119881936951203,1.1334369892317,3.9467553550551067,1.6481672227300002,0.18243667460690699,4,0.15879410985440001,0.15879410985433062,1.0734683955061827E-3,1.0734683955061827E-3,1,1.7577020674509631E-2,1.7577020674509631E-2,4.5069283780793926E-5,"4.5069283781e-05"]
[null,"FF1269","FAIRFIELD","Urban",589,1.4081700000000001,1.5904100000000001,1.5003458262564038,0,0,0,0,0,0,0,0,0,0,0,"0"]
[null,"FF1273","FAIRFIELD","Urban",73,1.9519135393020699,2.6260480218728897,3.4582375839236494,0.2260002777973,3.4020825101521115E-2,4,2.1774194052760001E-2,2.1774194052917851E-2,2.6085555157956641E-4,2.6085555157956641E-4,1,3.2777660931486495E-3,3.2777660931486495E-3,5.4629434885810824E-6,"5.4629434886e-06"]
[null,"FF1276","FAIRFIELD","Urban",483,4.8548610072081901,1.5307551801814501,2.6883719459337052,0,0,0,0,0,0,0,0,0,0,0,"0"]
[null,"FF1280","FAIRFIELD","Urban",142,1.72074934887626,0.79147972314793902,1.0109135322985443,0.34107017526470002,1.0206247530456335E-2,4,3.2860703775480005E-2,3.2860703776352869E-2,4.4522989431929402E-4,4.4522989431929402E-4,1,9.8332982794459485E-4,9.8332982794459485E-4,1.3657358721452706E-6,"1.3657358721e-06"]
[null,"FF1284","FAIRFIELD","Urban",898,3.6567886790379198,1.0079400000000001,2.1716030404901536,0.401445736198,0.61917901684768428,3,3.8677639899300002E-2,3.8677639899154063E-2,3.0046189187195955E-4,3.0046189187195955E-4,1,5.965534289530542E-2,5.965534289530542E-2,1.5296241768027031E-4,"0.00015296241768"]
[null,"FPHVRM","BROUGHTON PASS","Short rural",4,0,0,0,0,0,0,0,0,0,0,0,0,0,0,"0"]
[null,"FT1202","FIGTREE","Urban",1675,5.6357157083514107,5.4182896981331901,3.9661025935157652,1.367991552686,10.223102014225381,5,0.13180034034219998,0.13180034034137936,4.7991958547184809E-3,4.7991958547184809E-3,16,0.98495368789657556,0.98495368789657556,2.5115882688751525E-3,"0.0025115882689"]
[null,"FT1203","FIGTREE","Urban",334,3.4427020623977103,0.97836999999999996,1.8756558328447359,1.8144440054E-3,0.68233017344238289,1,1.7481419163000001E-4,1.7481419163459464E-4,1.3657358721452706E-6,1.3657358721452706E-6,4,6.57396962057126E-2,6.57396962057126E-2,1.5296241768027031E-4,"0.00015296241768"]
[null,"FT1204","FIGTREE","Urban",837,3.8393023449705401,3.4983499999999998,1.9208535831981981,0.30736397944880001,0.18031037303806191,2,2.9613250916110001E-2,2.9613250915725902E-2,7.7846944712280423E-5,7.7846944712280423E-5,1,1.7372160293687842E-2,1.7372160293687842E-2,7.2384001223699341E-5,"7.2384001224e-05"]
[null,"FT1205","FIGTREE","Short rural",1160,5.4389494483401002,4.1773299999999995,2.3431497403338275,0.53979709161239997,2.2861994468222191,4,0.13460110989656002,0.13460110989360574,1.2689547912763776E-3,1.2689547912763776E-3,2,0.57007528896115367,0.57007528896115367,9.3669364815665763E-4,"0.00093669364816"]
[null,"FT1206","FIGTREE","Short rural",446,11.839487196634501,0.89983000000000002,1.1723572952517163,1.54249003475875,0.46480952294953226,8,0.38462762009688001,0.38462762009119511,3.5417623979357394E-3,3.5417623979357394E-3,4,0.11590258386059171,0.11590258386059171,2.9691421300060089E-4,"0.000296914213"]
[null,"FT1207","FIGTREE","Urban",924,0,5.4094503432088707,2.4580442914234242,9.4804699283100008E-2,2.5828893923950678,5,9.1340415129499992E-3,9.1340415129075696E-3,3.2777660931486496E-5,3.2777660931486496E-5,8,0.24885073326358975,0.24885073326358975,8.8909405276657116E-4,"0.00088909405277"]
[null,"FT1208","FIGTREE","Urban",1560,8.5404474220899296,1.85738,3.284586846493974,2.7788493450050002,8.3406305339516713,5,0.26773066595782002,0.26773066596012596,4.3881093572027538E-3,4.3881093572027538E-3,11,0.80358532981155573,0.80358532981155573,1.9065672775147977E-3,"0.0019065672775"]
[null,"FT1209","FIGTREE","Urban",691,3.7488510960675296,1.34731355421489,3.1446477067523348,0.49756874245300003,0.29578272357014151,2,4.79386948486E-2,4.7938694848171141E-2,1.0297648475975341E-3,1.0297648475975341E-3,4,2.8497444708183217E-2,2.8497444708183217E-2,9.1504303433733133E-5,"9.1504303434e-05"]
[null,"FT1210","FIGTREE","Urban",1407,8.2355303127565804,2.06160910863187,3.2985415757053618,4.3050519097099997E-2,3.5021746126695454,2,4.1477398437499997E-3,4.1477398437051866E-3,1.2291622849307435E-5,1.2291622849307435E-5,8,0.33742007030808269,0.33742007030808269,1.0161074888760814E-3,"0.0010161074889"]
[null,"GG1232","GERRINGONG","Short rural",949,22.083908108993402,3.05728,1.7677389639034833,0.10584729209680001,2.5644330947774927,7,2.6393552719639994E-2,2.639355271994627E-2,3.414513449506911E-3,3.414513449506911E-3,12,0.63945424339896084,0.63945424339896084,2.8100809444699727E-3,"0.0028100809445"]
[null,"GG1258","GERRINGONG","Urban",1059,3.6924585357589801,2.0439660463220899,1.5451625254321955,0.76176880005000003,0.66744606246046745,1,7.3393280032999997E-2,7.33932800332147E-2,1.4367541374968246E-3,1.4367541374968246E-3,4,6.430567353996007E-2,6.430567353996007E-2,2.6085555157974666E-4,"0.00026085555158"]
[null,"GG1269","GERRINGONG","Short rural",945,8.8733400279680499,2.0695799999999998,2.0587350465804457,1.3860367652823002,0.80147393801666833,5,0.34561521331857997,0.3456152133187233,2.9868155950655692E-3,2.9868155950655692E-3,5,0.19985154289349971,0.19985154289349971,5.9736311901311366E-4,"0.00059736311901"]
[null,"GG1295","GERRINGONG","Short rural",246,44.627580412353403,0.31108999999999998,0.55650428716518441,2.8324746705748005,4.064382922815974,6,0.70629175356279983,0.70629175356120322,1.389134353681383E-3,1.389134353681383E-3,13,1.0134742497614082,1.0134742497614082,2.2657382206355378E-3,"0.0022657382206"]
[null,"GL1207","GLENORIE","Short rural",313,17.8191094185831,0.51095999999999997,1.7168743474528505,0.24068316225220002,0.50797344479708717,6,6.0015552648899996E-2,6.0015552649252409E-2,6.3271004913223287E-4,6.3271004913223287E-4,6,0.1266657240818635,0.1266657240818635,3.4639991516736772E-4,"0.00034639991517"]
[null,"GL1233","GLENORIE","Short rural",540,26.227189678358997,1.3106600000000002,2.6440887184066582,0.1277056722248,1.1535894778174118,5,3.1844049344519995E-2,3.1844049344314451E-2,1.9087342264324341E-4,1.9087342264324341E-4,9,0.2876533173093917,0.2876533173093917,8.4479162984694783E-4,"0.00084479162985"]
[null,"GL1255","GLENORIE","Short rural",483,17.7788758335689,0.12758,2.51276324053614,2.6942650685723,0.50995799292800925,5,0.67182849670150002,0.67182849669506206,3.8563500759958994E-3,3.8563500759958994E-3,7,0.12716058110353115,0.12716058110353115,3.3933052914354386E-4,"0.00033933052914"]
[null,"GV1204","GRANVILLE","Urban",206,0.65864,0.54721000000000009,0.67225556831923228,0,0,0,0,0,0,0,0,0,0,0,"0"]
[null,"GV1208","GRANVILLE","Urban",1810,0.63588,4.8558790561160805,2.1863395597010635,2.6696283210639997,0,3,0.25720767106039999,0.25720767106524667,2.6235786103910646E-3,2.6235786103910646E-3,0,0,0,0,"0"]
[null,"GV1223","GRANVILLE","Urban",1260,4.1976233549130999,2.4342100000000002,3.8683299420092614,0.61618801931199996,8.8454145263954911E-2,4,5.9367172626199997E-2,5.9367172626282771E-2,2.5812407983545615E-4,2.5812407983545615E-4,1,8.5221918421864891E-3,8.5221918421864891E-3,1.7754566337888518E-5,"1.7754566338e-05"]
[null,"GV1234","GRANVILLE","Urban",157,0,2.0254984269030798,1.0115536982770217,0,0,0,0,0,0,0,0,0,0,0,"0"]
[null,"GV1241","GRANVILLE","Urban",827,0.78207535456489696,1.1181087651824801,0.9391133290616922,0,0,0,0,0,0,0,0,0,0,0,"0"]
[null,"GV1245","GRANVILLE","Urban",723,1.2105148330064301,4.9525551326260606,2.667358243656071,0,8.5052062753802789E-3,0,0,0,0,0,1,8.1944152328716237E-4,8.1944152328716237E-4,1.3657358721452706E-6,"1.3657358721e-06"]
[null,"GV1249","GRANVILLE","Urban",599,1.53272553647211,1.6614800000000001,1.1888695129505402,0,0,0,0,0,0,0,0,0,0,0,"0"]
[null,"GV1256","GRANVILLE","Urban",733,1.6264225404861499,1.2756500000000002,2.0264809696469785,4.8479675769999998E-3,0,1,4.6708166826999999E-4,4.6708166827368254E-4,1.3657358721452706E-6,1.3657358721452706E-6,0,0,0,0,"0"]
[null,"GV1267","GRANVILLE","Urban",82,0,2.3035399999999999,3.8732385162628797,0,0,0,0,0,0,0,0,0,0,0,"0"]
[null,"GV1271","GRANVILLE","Urban",1353,4.8456910334609899,0.87846000000000002,3.3543071453860773,4.692393178853,0,12,0.45209271707800003,0.45209271707688825,3.3132752258244256E-3,3.3132752258244256E-3,0,0,0,0,"0"]
[null,"GV1278","GRANVILLE","Urban",216,0.51296015704853404,1.51427,1.4153460102252311,0,0,0,0,0,0,0,0,0,0,0,"0"]
[null,"GV1282","GRANVILLE","Short rural",856,1.6022939834515701,3.9779419718815703,1.3336791218280355,0,9.5258310284259129E-2,0,0,0,0,0,2,2.3753137040048073E-2,2.3753137040048073E-2,5.3020395178678732E-5,"5.3020395179e-05"]
[null,"GV1286","GRANVILLE","Urban",391,0.97909917969834204,4.0074227891742602,3.0443347140613848,0,0.10844138001109856,0,0,0,0,0,1,1.044787942191132E-2,1.044787942191132E-2,2.0486038082179059E-5,"2.0486038082e-05"]
[null,"GV1293","GRANVILLE","Urban",367,1.5173598280466398,2.9355300000000004,1.8987830989878269,0.97529200360829993,0,7,9.3965359475130003E-2,9.3965359475338905E-2,3.6738294960707779E-4,3.6738294960707779E-4,0,0,0,0,"0"]
[null,"GV1297","GRANVILLE","Urban",12,7.8969999999999999E-2,2.03315,0.73267504304981901,0,1.7010412550760558E-4,0,0,0,0,0,1,1.6388830465743248E-5,1.6388830465743248E-5,2.7314717442905412E-6,"2.7314717443e-06"]
[null,"H745","OAKDALE","Short rural",567,45.1027270512268,0.68565999999999994,1.6766251817266731,0.79020453970009996,1.256063038091952,14,0.19704146194619998,0.19704146194902972,2.1667668163020044E-3,2.1667668163020044E-3,12,0.31320561309250294,0.31320561309250294,9.2608956912092189E-4,"0.00092608956912"]
[null,"HBA2","HELENSBURGH","Short rural",812,17.791185808554101,0.36002000000000001,1.9308587169530866,6.0190919550742015,2.0724352624343281,10,1.5008907426403,1.5008907426390017,1.439326994450532E-2,1.439326994450532E-2,8,0.51677211834152204,0.51677211834152204,1.0816160616450461E-3,"0.0010816160616"]
[null,"HBB2","HELENSBURGH","Short rural",1388,12.8843784006023,1.00301,3.1254833728569551,3.8462952585210006,2.6247775333013159,8,0.95909299777849999,0.95909299777314339,1.4121098582588101E-2,1.4121098582588101E-2,7,0.65450143155066987,0.65450143155066987,1.9122689194443464E-3,"0.0019122689194"]
[null,"HBC2","HELENSBURGH","Short rural",879,11.864974748989599,1.56596,2.7903005956179561,0,1.8293564670839597,0,0,0,0,0,8,0.45615920257325654,0.45615920257325654,1.0391997455021032E-3,"0.0010391997455"]
[null,"HBD2","HELENSBURGH","Short rural",13,5.2451607699329701,7.288E-2,1.8478441775575492,2.5402216076E-2,0,1,6.3341698772999997E-3,6.3341698773461521E-3,1.7673465059559576E-5,1.7673465059559576E-5,0,0,0,0,"0"]
[null,"HKA2","HUSKISSON","Short rural",140,2.10514,4.5819099999999997,0.19732354184212283,0,0,0,0,0,0,0,0,0,0,0,"0"]
[null,"HKB2","HUSKISSON","Short rural",1080,10.443627421419901,3.6330000000000001E-2,1.8591436151459118,3.0281255312300002,5.1527374685012193,4,0.75507827614870004,0.75507827614590461,1.1825054330929693E-2,1.1825054330929693E-2,10,1.2848609098299812,1.2848609098299812,3.0575094553038067E-3,"0.0030575094553"]
[null,"HKC2","HUSKISSON","Short rural",814,13.191341665198001,0.71838999999999997,1.6601129640278491,0,4.4699111580261057,0,0,0,0,0,6,1.1145947474461844,1.1145947474461844,3.2589869569827862E-3,"0.003258986957"]
[null,"HKD2","HUSKISSON","Short rural",1012,9.9414092571296209,2.0099067715034402,1.9208332604687164,0.29430078735189996,9.8235132480642227E-3,6,7.3385376162749996E-2,7.3385376163250832E-2,4.0000120625809724E-3,4.0000120625809724E-3,2,2.4495422572549572E-3,2.4495422572549572E-3,7.0693860238238313E-6,"7.0693860238e-06"]
[null,"HKE2","HUSKISSON","Short rural",0,3.32108447631974,0,0,0,2.2964056943526753E-2,0,0,0,0,0,1,5.726202679297303E-3,5.726202679297303E-3,2.1208158071471491E-5,"2.1208158071e-05"]
[null,"HKF2","HUSKISSON","Short rural",2328,14.4018837326475,1.0489568804857901,3.0660089050469788,9.0068575168029987,8.5757427860907658,6,2.2459050581420001,2.2459050581457003,1.7281114135237356E-2,1.7281114135237356E-2,11,2.1384044395744231,2.1384044395744231,6.2599413240960024E-3,"0.0062599413241"]
[null,"HKG2","HUSKISSON","Short rural",2326,12.957111253626001,1.4648699999999999,2.8839782171351578,8.4927794336036992,4.5696347016049392,6,2.1177171118858702,2.1177171118904972,3.3073876733251163E-2,3.3073876733251163E-2,11,1.1394613127849846,1.1394613127849846,2.877240111696299E-3,"0.0028772401117"]
[null,"HKH2","HUSKISSON","Urban",223,0,3.3846500000000002,1.2106453175835108,0,0.20922807437435487,0,0,0,0,0,1,2.0158261472864192E-2,2.0158261472864192E-2,9.8332982794459482E-5,"9.8332982794e-05"]
[null,"HR1206","HOLROYD","Urban",1513,6.4081194666725292,0.52742632462768202,4.0150702101869147,0.80310410255609999,0,4,7.7375765835729998E-2,7.7375765836390303E-2,2.2002004900260313E-3,2.2002004900260313E-3,0,0,0,0,"0"]
[null,"HR1210","HOLROYD","Urban",614,2.3574667296247598,0.69137000000000004,1.5305555636216972,2.2453744567E-2,0,1,2.1633256215000001E-3,2.1633256214781088E-3,2.458324569861487E-5,2.458324569861487E-5,0,0,0,0,"0"]
[null,"HR1213","HOLROYD","Urban",909,5.0213738625806599,0.53095999999999999,2.9425991303071646,0,0,0,0,0,0,0,0,0,0,0,"0"]
[null,"HR1217","HOLROYD","Urban",327,0.46991000000000005,1.6475499999999998,2.1846934186135503,0.11430997234,5.3157539221126746E-2,1,1.1013294073E-2,1.1013294072979463E-2,1.434022665752534E-4,1.434022665752534E-4,2,5.1215095205447651E-3,5.1215095205447651E-3,8.194415232871624E-6,"8.1944152329e-06"]
[null,"HR1236","HOLROYD","Urban",1773,3.0502732497446599,3.3278677996770698,3.1563739216596902,0.33854973579059999,-0.66340608947966184,4,3.2617869834720002E-2,3.2617869834445493E-2,2.2261494715967908E-4,2.2261494715967908E-4,1,-6.3916438816398663E-2,-6.3916438816398663E-2,8.8772831689442586E-5,"8.8772831689e-05"]
[null,"HR1239","HOLROYD","Urban",1031,3.05746332625267,2.8962025620633098,1.7909405350262191,0.85820366387189995,1.5351897327061403,2,8.2684381171619997E-2,8.2684381171418977E-2,1.5979109704099666E-4,1.5979109704099666E-4,5,0.1479091949533328,0.1479091949533328,4.0835502577143593E-4,"0.00040835502577"]
[null,"HR1243","HOLROYD","Urban",1072,3.3704020060686299,1.5539792601804399,3.1076908232011897,0,0,0,0,0,0,0,0,0,0,0,"0"]
[null,"HR1247","HOLROYD","Short rural",1295,5.0757491244910602,1.51942,3.5056708345194076,0.65050652662599995,1.1496203815555677,3,0.1622070623138,0.16220706231663778,6.4331412816796862E-4,6.4331412816796862E-4,4,0.28666360326605633,0.28666360326605633,6.645222862394401E-4,"0.00066452228624"]
[null,"HR1250","HOLROYD","Urban",1624,1.9869326916164101,3.3373514556133101,3.0484094213212241,2.3247563819000002E-3,1.6746751156223769,1,2.2398068303E-4,2.2398068303182439E-4,1.3657358721452706E-6,1.3657358721452706E-6,3,0.16134803593524227,0.16134803593524227,4.0972076164358119E-4,"0.00040972076164"]
[null,"HR1269","HOLROYD","Urban",1997,5.5803379466422705,1.0147699999999999,3.8041609236904494,0.68204666656199997,1.1288535028998476,2,6.5712381488500005E-2,6.5712381488269703E-2,1.2837917198165545E-4,1.2837917198165545E-4,3,0.10876037617828863,0.10876037617828863,2.7997585378978048E-4,"0.00027997585379"]
[null,"HR1273","HOLROYD","Urban",1514,6.15269077474938,1.0547500000000001,3.6723985071361964,0.17899206606500001,0,4,1.7245146857499997E-2,1.7245146857578331E-2,2.3490657000898652E-4,2.3490657000898652E-4,0,0,0,0,"0"]
[null,"HR1276","HOLROYD","Urban",1759,5.1323527234002801,1.77674,4.0669947839967664,2.2962639409509995,0.68070000890626836,4,0.22123555392539998,0.22123555392881236,2.4951994384094091E-3,2.4951994384094091E-3,2,6.5582636580415896E-2,6.5582636580415896E-2,1.9393449384462843E-4,"0.00019393449384"]
[null,"HR1280","HOLROYD","Urban",546,2.2152618526164702,1.0343180558756802,0.88041112497178275,0.74967723180000001,0.11574168206413329,1,7.2228307334E-2,7.222830733427478E-2,7.3613163508630083E-4,7.3613163508630083E-4,1,1.1151233396066135E-2,1.1151233396066135E-2,3.1411925059341222E-5,"3.1411925059e-05"]
[null,"HT1213","HUNTINGWOOD","Short rural",82,3.29013212927208,1.27078459185477,3.1688724002871069,1.6443398799E-3,0,1,4.1002438938000002E-4,4.1002438938178218E-4,3.5346930119119156E-6,3.5346930119119156E-6,0,0,0,0,"0"]
[null,"HT1219","HUNTINGWOOD","Urban",234,0,1.54024658930817,1.2828722981393477,0,0,0,0,0,0,0,0,0,0,0,"0"]
[null,"HT1238","HUNTINGWOOD","Urban",78,5.3138662446140899,4.7726661729026905,3.6419652197466794,2.8492441023E-3,2.7358413519139899E-2,1,2.7451291030000001E-4,2.7451291030119941E-4,4.097207616435812E-6,4.097207616435812E-6,2,2.6358702332403721E-3,2.6358702332403721E-3,5.4629434885810824E-6,"5.4629434886e-06"]
[null,"HT1245","HUNTINGWOOD","Urban",3,0,0.14254,0.13851972410483643,0,0,0,0,0,0,0,0,0,0,0,"0"]
[null,"HT1246","HUNTINGWOOD","Urban",2,0,1.0770561796176601,4.5232908675448584,0,0,0,0,0,0,0,0,0,0,0,"0"]
[null,"HT1260","HUNTINGWOOD","Urban",19,0.28852,3.4518,1.1119581432506058,0,1.6159891923222532E-2,0,0,0,0,0,1,1.5569388942456085E-3,1.5569388942456085E-3,4.097207616435812E-6,"4.0972076164e-06"]
[null,"HT1267","HUNTINGWOOD","Urban",4,0,1.0526300000000002,1.8225017339016307,0,2.5515618826140837E-3,0,0,0,0,0,2,2.4583245698614871E-4,2.4583245698614871E-4,4.097207616435812E-6,"4.0972076164e-06"]
[null,"HT1268","HUNTINGWOOD","Short rural",22,0,3.6846999999999999,0.39277739257250255,0,0,0,0,0,0,0,0,0,0,0,"0"]
[null,"HT1272","HUNTINGWOOD","Urban",12,0,1.9177999999999999,0,1.0659858532000001E-2,0,1,1.0270333759E-3,1.0270333758532434E-3,1.6388830465743248E-5,1.6388830465743248E-5,0,0,0,0,"0"]
[null,"HT1290","HUNTINGWOOD","Urban",2,0,2.6959,0.89836625646336465,0,1.5592878171530513E-3,0,0,0,0,0,1,1.5023094593597978E-4,1.5023094593597978E-4,2.7314717442905412E-6,"2.7314717443e-06"]
[null,"HT1291","HUNTINGWOOD","Urban",25,0,3.5522441535476101,3.4843421299348898,0,2.8917701336292949E-2,0,0,0,0,0,1,2.7861011791763522E-3,2.7861011791763522E-3,8.194415232871624E-6,"8.1944152329e-06"]
[null,"HT1293","HUNTINGWOOD","Short rural",9,3.3535300000000001,3.9736700000000003,0.99969538562808213,1.22474970366E-2,0,2,3.0539747623000001E-3,3.0539747622918951E-3,2.1208158071471491E-5,2.1208158071471491E-5,0,0,0,0,"0"]
[null,"HT1294","HUNTINGWOOD","Urban",821,4.5333488829358402,7.3376701789688594,3.9540308922073337,1.5336587955479399,6.8041650203042236E-3,5,0.14776169547575299,0.14776169547914111,1.2086762468485645E-3,1.2086762468485645E-3,1,6.555532186297299E-4,6.555532186297299E-4,1.3657358721452706E-6,"1.3657358721e-06"]
[null,"HT1298","HUNTINGWOOD","Urban",2,0,0.21706,1.1825796281778798,0,0,0,0,0,0,0,0,0,0,0,"0"]
[null,"IHB2","INNER HARBOUR","Urban",2,0,1.1E-4,0,0,0,0,0,0,0,0,0,0,0,0,"0"]
[null,"IHC2","INNER HARBOUR","Urban",9,0,2.3019000000000003,0.67535732490542666,0,0,0,0,0,0,0,0,0,0,0,"0"]
[null,"IHD2","INNER HARBOUR","Urban",2,0,0.50653999999999999,2.823203094638743,0,0,0,0,0,0,0,0,0,0,0,"0"]
[null,"IHF2","INNER HARBOUR","Urban",4,0,1.1E-4,3.8786132431238456,0,0,0,0,0,0,0,0,0,0,0,"0"]
[null,"IHH2","INNER HARBOUR","Urban",2,0,1E-4,1.4276412615578926,0,0,0,0,0,0,0,0,0,0,0,"0"]
[null,"IHK2","INNER HARBOUR","Urban",4,0,0.71936999999999995,1.0209326379299539,0,0,0,0,0,0,0,0,0,0,0,"0"]
[null,"IHL2","INNER HARBOUR","Short rural",6,0,4.0903200000000002,0.77894481738310573,0,0,0,0,0,0,0,0,0,0,0,"0"]
[null,"J459","MINTO","Short rural",1833,0,0,4.6107192497483513,0.13326240699124001,0.16131541235637931,7,3.3229649004679992E-2,3.3229649004983909E-2,6.3164964122865942E-3,6.3164964122865942E-3,2,4.0224806475557595E-2,4.0224806475557595E-2,1.9087342264324344E-4,"0.00019087342264"]
[null,"J460","MINTO","Urban",57,0,3.9218963926972501,3.0230060094768865,0,0,0,0,0,0,0,0,0,0,0,"0"]
[null,"J461","MINTO","Urban",4,0,0.82053999999999994,4.5408598671764002,0,0,0,0,0,0,0,0,0,0,0,"0"]
[null,"J462","MINTO","Urban",31,0,2.1325098091934502,3.0738128331655612,0,0,0,0,0,0,0,0,0,0,0,"0"]
[null,"J464","MINTO","Urban",14,0,2.7700526809168502,3.1182688038931747,0,0,0,0,0,0,0,0,0,0,0,"0"]
[null,"J465","MINTO","Urban",1280,0,10.4505345982192,4.13440527766691,2.3318440538400001E-2,0.16478837158549292,2,2.24663550972E-3,2.2466355096789703E-3,2.458324569861487E-5,2.458324569861487E-5,1,1.587667951368877E-2,1.587667951368877E-2,4.2337812036503386E-5,"4.2337812037e-05"]
[null,"J467","MINTO","Urban",24,0,1.8290147688643401,3.1500230686985917,0,2.1263015688450699E-2,0,0,0,0,0,1,2.0486038082179058E-3,2.0486038082179058E-3,6.8286793607263528E-6,"6.8286793607e-06"]
[null,"J468","MINTO","Urban",1198,1.15917,10.8888013888385,3.9438796888343335,1.1005595166897999,0.8188387341622364,4,0.10603436737742999,0.10603436737748667,1.7071698401815883E-3,1.7071698401815883E-3,2,7.8891732654471552E-2,7.8891732654471552E-2,2.1442053192680748E-4,"0.00021442053193"]
[null,"J469","MINTO","Urban",929,2.2696681007395698,2.1214472557017396,3.7343015411184997,8.5193816191999998E-3,0.84570101064864578,3,8.2080725917000003E-4,8.2080725915930762E-4,4.097207616435812E-6,4.097207616435812E-6,3,8.1479802132186849E-2,8.1479802132186849E-2,1.912030221003379E-4,"0.0001912030221"]
[null,"J470","MINTO","Urban",15,0.14622811481437001,1.10178,3.2389350101538006,0,0,0,0,0,0,0,0,0,0,0,"0"]
[null,"J472","MINTO","Urban",639,1.7239317304223301,0.88998545471645796,3.2960926868035734,0,0.9415263346845969,0,0,0,0,0,2,9.0712176627888871E-2,9.0712176627888871E-2,1.4067079483096287E-4,"0.00014067079483"]
[null,"J473","MINTO","Urban",758,0,7.3759815100071799,2.4768326548234945,4.6636881077E-3,4.7841785299014068E-2,1,4.4932710194000002E-4,4.4932710193579402E-4,1.6388830465743248E-5,1.6388830465743248E-5,3,4.6093585684902879E-3,4.6093585684902879E-3,1.5023094593597976E-5,"1.5023094594e-05"]
[null,"J474","MINTO","Urban",975,0,0,3.1055670979709968,3.2404835909400007E-2,6.2371512686122045E-2,4,3.1220722036899998E-3,3.1220722037240884E-3,7.5115472967989889E-5,7.5115472967989889E-5,2,6.0092378374391906E-3,6.0092378374391906E-3,8.194415232871624E-6,"8.1944152329e-06"]
[null,"J475","MINTO","Urban",11,0,2.2385700000000002,1.2765214451782625,0,0,0,0,0,0,0,0,0,0,0,"0"]
[null,"J477","MINTO","Short rural",1310,0,0,2.8959889502551626,0.41839944737079998,0.20963915934433158,14,0.10432999893920999,0.10432999893959209,5.2101374995581632E-3,5.2101374995581632E-3,3,5.2274574953165315E-2,5.2274574953165315E-2,4.4183662648898941E-4,"0.00044183662649"]
[null,"J478","MINTO","Urban",1587,2.1823261309420898,10.1135895310852,3.1246196568542546,0.60391217157779997,1.9349344276490134E-2,11,5.8184445360720004E-2,5.8184445361004963E-2,2.7178143855690885E-4,2.7178143855690885E-4,1,1.8642294654782944E-3,1.8642294654782944E-3,2.8680453315050682E-5,"2.8680453315e-05"]
[null,"J480","MINTO","Urban",1433,0.93934554284108107,12.482382023283,5.8046796064325044,2.6426242911628601,0.40938392872163742,7,0.25460594422824401,0.25460594422880994,2.2302466792132273E-3,2.2302466792132273E-3,3,3.9442451987555416E-2,3.9442451987555416E-2,1.1335607738805746E-4,"0.00011335607739"]
[null,"J481","MINTO","Urban",1620,0.25427,11.211582850969501,3.9629322477175908,0.71272211053300005,0.34077526476690317,5,6.8667833915310006E-2,6.8667833915592058E-2,3.3050808105915546E-4,3.3050808105915546E-4,3,3.2832290366372308E-2,3.2832290366372308E-2,1.1472181326020273E-4,"0.00011472181326"]
[null,"J482","MINTO","Urban",768,0,0,2.819778714722132,2.3728391480820004,0.88645512405150961,3,0.2286132591067,0.22861325911014113,1.8423776915239701E-3,1.8423776915239701E-3,2,8.5406292764604499E-2,8.5406292764604499E-2,2.2671215477611492E-4,"0.00022671215478"]
[null,"J483","MINTO","Urban",1121,0,11.9764310076526,3.5818810700524382,0.19078595209949997,0.32692595388182566,3,1.838143910277E-2,1.8381439103203199E-2,8.6041359945152052E-5,8.6041359945152052E-5,4,3.1497966419286379E-2,3.1497966419286379E-2,6.8286793607263526E-5,"6.8286793607e-05"]
[null,"J489","KENTLYN","Urban",1581,7.9577826506065499,0.61391999999999991,3.0484094213212241,2.4509169416699998E-2,1.1389888737113425,2,2.3613573229800001E-3,2.3613573229391729E-3,3.8240604420067578E-5,3.8240604420067578E-5,4,0.1097368773268725,0.1097368773268725,2.8543879727836155E-4,"0.00028543879728"]
[null,"J491","KENTLYN","Urban",1579,6.7468849300135698,6.9621984777277905,3.0865145390877391,0.45938036628000001,1.6627678268368447,5,4.4259402408799997E-2,4.4259402408611787E-2,1.6661977640172301E-4,1.6661977640172301E-4,4,0.16020081780264023,0.16020081780264023,3.8923472356140211E-4,"0.00038923472356"]
[null,"J492","KENTLYN","Urban",1545,10.029605500713799,4.4438694769845295,2.781673596955617,0.89284122305699998,1.7577426302452577E-2,2,8.6021567047899997E-2,8.6021567047733075E-2,2.1947375465367065E-3,2.1947375465367065E-3,1,1.6935124814601355E-3,1.6935124814601355E-3,5.4629434885810824E-6,"5.4629434886e-06"]
[null,"J493","KENTLYN","Urban",803,7.1163866512437293E-2,3.86079361539386,1.8290456527927343,0.84833762459376993,0,6,8.1733829004491998E-2,8.1733829004405859E-2,1.136292245624865E-3,1.136292245624865E-3,0,0,0,0,"0"]
[null,"J495","KENTLYN","Urban",1045,12.571570958588399,8.1257364304748094,2.6102005670062978,0.20849095649639998,0.2406973375932619,4,2.0087243207109997E-2,2.008724320751264E-2,1.8710581448390211E-4,1.8710581448390211E-4,3,2.3190195109026694E-2,2.3190195109026694E-2,2.4446672111400346E-4,"0.00024446672111"]
[null,"J496","KENTLYN","Urban",949,3.1819971933554898,1.5507200000000001,2.3815698604072062,0.69724961616399994,0,3,6.7177122938000003E-2,6.7177122938284498E-2,1.5105038745899624E-3,1.5105038745899624E-3,0,0,0,0,"0"]
[null,"J497","KENTLYN","Short rural",998,9.7989396987514787,3.9948960359374599,1.3146265629447778,2.5632990672339999,0.72528146513305336,9,0.6391714679678,0.63917146795800783,1.138878088438019E-2,1.138878088438019E-2,2,0.18085256795447316,0.18085256795447316,5.4080803082252307E-4,"0.00054080803082"]
[null,"J499","KENTLYN","Urban",1308,0.56356684605251206,7.9486509840550896,2.438727537056979,0.23465864114029999,2.2680550067680745E-3,10,2.2608391627890002E-2,2.2608391627492806E-2,9.5601511050168934E-5,9.5601511050168934E-5,1,2.1851773954324329E-4,2.1851773954324329E-4,1.3657358721452706E-6,"1.3657358721e-06"]
[null,"J500","KENTLYN","Urban",769,1.4085616985030198,4.1114061001608198,1.8290456527927343,0.1498900852592,1.4091709263925893,4,1.4441291112289999E-2,1.4441291112064091E-2,3.8240604420067578E-5,3.8240604420067578E-5,4,0.13576780304996136,0.13576780304996136,3.4689691152489871E-4,"0.00034689691152"]
[null,"J502","KENTLYN","Urban",783,1.5178348410165399,3.5786458160733501,2.0767289182750837,0.11028417470400001,0.73867716501677727,2,1.0625425085300001E-2,1.0625425085290206E-2,3.0046189187195955E-5,3.0046189187195955E-5,3,7.1168496297490044E-2,7.1168496297490044E-2,1.1745328500449327E-4,"0.000117453285"]
[null,"J503","KENTLYN","Urban",955,0,6.3109749404604596,2.0005186827420531,1.5200221148918001,0.22170237691157929,6,0.14644785756798001,0.14644785757013737,1.4982122517433617E-3,1.4982122517433617E-3,1,2.1360109040352033E-2,2.1360109040352033E-2,9.28700393058784E-5,"9.2870039306e-05"]
[null,"J504","KENTLYN","Urban",1206,4.28348860143966,1.7455036162508499,2.5911480081230405,4.8763182646E-3,1.0262948905625537,1,4.6981314002000001E-4,4.698131400179731E-4,1.3657358721452706E-6,1.3657358721452706E-6,3,9.8879277143317595E-2,9.8879277143317595E-2,2.4856392873043927E-4,"0.00024856392873"]
[null,"J505","MACQUARIE FIELDS","Urban",375,1.9198824126218799,0.52107000000000003,0.66683956091401775,0,0,0,0,0,0,0,0,0,0,0,"0"]
[null,"J506","MACQUARIE FIELDS","Urban",1390,3.7192646518697803,8.1711811810592803,2.9912517446714513,0.26782894561640003,4.0754113402863841E-2,3,2.5804213568092E-2,2.5804213568312744E-2,6.6921057735118259E-5,6.6921057735118259E-5,2,3.9264906324176533E-3,3.9264906324176533E-3,8.4675624073006771E-5,"8.4675624073e-05"]
[null,"J507","MACQUARIE FIELDS","Short rural",877,5.8793868590992098,4.9963464285998898,1.7147302994931883,5.2023511718000005E-3,0.45162645322269285,2,1.2972323353699999E-3,1.2972323353716729E-3,7.0693860238238313E-6,7.0693860238238313E-6,1,0.11261531935951363,0.11261531935951363,4.1709377540560604E-4,"0.00041709377541"]
[null,"J509","MACQUARIE FIELDS","Urban",261,5.0577424123213204,1.1146170124451902,1.8862033294425071,8.0218270521000001E-2,0,2,7.7286993003999995E-3,7.7286993004700866E-3,7.5115472967989889E-5,7.5115472967989889E-5,0,0,0,0,"0"]
[null,"J510","MACQUARIE FIELDS","Urban",1232,2.0763411670237804,5.9538093721099905,2.3244121837574334,0.39991479906909,1.2859871888374983,10,3.8530140425381998E-2,3.8530140424962375E-2,1.9393449384462848E-4,1.9393449384462848E-4,4,0.12389955832101895,0.12389955832101895,3.8377178007282104E-4,"0.00038377178007"]
[null,"J512","MACQUARIE FIELDS","Urban",872,3.2274062177201999,1.3850899999999999,1.7718879761429611,1.2644406662699999E-2,0,4,1.21823639796E-3,1.2182363979535813E-3,5.4629434885810824E-6,5.4629434885810824E-6,0,0,0,0,"0"]
[null,"J513","MACQUARIE FIELDS","Urban",392,1.2616807380956501,0.77899055446737309,1.4162402103221514,2.6791399766999999E-2,0.27875813567558866,1,2.5812407984E-3,2.5812407983545615E-3,2.8680453315050682E-5,2.8680453315050682E-5,3,2.6857195925736745E-2,2.6857195925736745E-2,8.4675624073006771E-5,"8.4675624073e-05"]
[null,"J514","MACQUARIE FIELDS","Urban",1940,0,9.8162625173656899,2.9721991857881931,2.1294201444859002,0,10,0.20516084271281998,0.20516084271366258,2.8147816324914027E-3,2.8147816324914027E-3,0,0,0,0,"0"]
[null,"J515","MACQUARIE FIELDS","Urban",590,0.88593960614571599,8.8622309568476201,3.3532503634533462,0.11517466831000001,0,1,1.1096603961E-2,1.1096603961180323E-2,2.32175098264696E-5,2.32175098264696E-5,0,0,0,0,"0"]
[null,"J516","MACQUARIE FIELDS","Urban",1444,3.2272320213750598,2.86877101788239,2.7054633614225865,1.6146992360798003,0.60642120743461392,6,0.15556960745949,0.15556960746019563,8.4129329724148664E-4,8.4129329724148664E-4,2,5.8426180610374676E-2,5.8426180610374676E-2,2.4310098524185818E-4,"0.00024310098524"]
[null,"JBA2","JAMBEROO","Short rural",711,55.053010096200296,0.37704000000000004,2.4449132678410828,3.0608961604028395,3.8140455176001957,27,0.76324979675785998,0.76324979675515181,4.4501785019971018E-3,4.4501785019971018E-3,16,0.9510513632479255,0.9510513632479255,2.9267258138630662E-3,"0.0029267258139"]
[null,"JBB2","JAMBEROO","Short rural",320,44.7872396402962,2.6102534784743301,0.62177390830215284,1.4406968909871003,1.3624064672217902,33,0.35924498957625001,0.35924498957265566,2.3187586158142167E-3,2.3187586158142167E-3,19,0.33972288006786611,0.33972288006786611,1.0568732105616628E-3,"0.0010568732106"]
[null,"JS1122","JORDAN SPRINGS","Short rural",949,18.8815658465385,7.1404799999999993,3.7343015411184997,0.13540288390399999,2.4309722329729837,3,3.3763387649299995E-2,3.3763387649782615E-2,3.1105298504824857E-4,3.1105298504824857E-4,11,0.60617510869181013,0.60617510869181013,1.4032731257290305E-3,"0.0014032731257"]
[null,"JS1142","JORDAN SPRINGS","Urban",664,0,7.1162399999999995,3.1055670979709968,0,0,0,0,0,0,0,0,0,0,0,"0"]
[null,"JS1152","JORDAN SPRINGS","Urban",904,1.8554544503072701,5.3901671399475699,3.8867220121845607,1.3098017664000001E-2,0.17265568739021966,1,1.2619399458999999E-3,1.26193994586223E-3,1.6388830465743248E-5,1.6388830465743248E-5,1,1.6634662922729394E-2,1.6634662922729394E-2,3.9606340292212845E-5,"3.9606340292e-05"]
[null,"JS1222","JORDAN SPRINGS","Urban",1050,0,13.894309999999999,3.7724066588850143,0,0.20873193734162435,0,0,0,0,0,3,2.0110460717339108E-2,2.0110460717339108E-2,6.8286793607263526E-5,"6.8286793607e-05"]
[null,"JS1232","JORDAN SPRINGS","Urban",982,0,6.5789230432962702,3.9819848066008485,8.0671881522E-2,0,1,7.7724028483999999E-3,7.7724028483787348E-3,2.8680453315050682E-5,2.8680453315050682E-5,0,0,0,0,"0"]
[null,"JS1252","JORDAN SPRINGS","Short rural",543,25.013400593724299,1.8528499999999999,3.1627247746207701,1.7282563242955402,1.0650644558344955,9,0.43094937532089,0.43094937532549943,4.9597395424235274E-3,4.9597395424235274E-3,5,0.26557915945000177,0.26557915945000177,5.9382842600120178E-4,"0.000593828426"]
[null,"KC1214","KEMPS CREEK","Short rural",239,12.5796886915867,1.9296185967766402,3.4144827473629582,0.72464357466599993,0.15337721983269104,2,0.18069350677349999,0.18069350676891435,1.7178608037835001E-3,1.7178608037835001E-3,3,3.8245378388886926E-2,3.8245378388886926E-2,8.8367325297797884E-5,"8.8367325298e-05"]
[null,"KC1221","KEMPS CREEK","Short rural",482,15.317925411243499,0.207506589271685,3.645003467803269,0.25837399130670002,0.34084614148586467,4,6.4426849527989993E-2,6.4426849528093605E-2,2.3116892297841713E-3,2.3116892297841713E-3,3,8.4991693471422006E-2,8.4991693471422006E-2,2.8277544095295322E-4,"0.00028277544095"]
[null,"KC1236","KEMPS CREEK","Short rural",260,32.243153848744697,0.34937654353501396,2.5241236463129182,1.3020366466741997,0.34507039393597022,12,0.32466936278397007,0.32466936277991093,2.5167384369705948E-3,2.5167384369705948E-3,7,8.604503198897176E-2,8.604503198897176E-2,2.2268565975045067E-4,"0.00022268565975"]
[null,"KC1262","KEMPS CREEK","Short rural",119,17.850467138547103,5.4549999999999994E-2,0.69428540707064579,0.12065755769679999,0.15947261766338025,4,3.0086566667730002E-2,3.0086566667494836E-2,5.7611794844275913E-4,5.7611794844275913E-4,3,3.9765296384009045E-2,3.9765296384009045E-2,1.131101763811813E-4,"0.00011311017638"]
[null,"KC1284","KEMPS CREEK","Short rural",823,21.2584550807012,4.6375399999999996,3.4504641398992804,0.53032796196340004,2.3786510390356028,10,0.13223993496099998,0.13223993496163305,5.9983740412106329E-3,5.9983740412106329E-3,10,0.59312855678484322,0.59312855678484322,1.336113958502704E-3,"0.0013361139585"]
[null,"KC1288","KEMPS CREEK","Short rural",410,18.0211117542555,3.4785849490447998,3.3388415482552283,2.7854550551300001E-2,1.6744483101217003,2,6.9456717684000004E-3,6.945671768374395E-3,1.4633629069234033E-3,1.4633629069234033E-3,15,0.4175320773390831,0.4175320773390831,9.6143649924004099E-4,"0.00096143649924"]
[null,"KMA2","KIAMA","Short rural",1560,6.3689515950068198,3.58602184197948,2.2034970240607272,3.3985113584,2.476219930358007,1,0.84743583827000002,0.84743583826715185,5.526517755538648E-3,5.526517755538648E-3,7,0.61745784878583299,0.61745784878583299,2.170301509313916E-3,"0.0021703015093"]
[null,"KMB2","KIAMA","Short rural",1440,8.7253524079875895,1.7906931131891699,2.2708744932954792,5.147830686402,1.5606344748133198,5,1.2836373791143001,1.2836373791129532,1.1496733255179123E-2,1.1496733255179123E-2,4,0.38915202714644231,0.38915202714644231,1.6471669435509527E-3,"0.0016471669436"]
[null,"KMC2","KIAMA","Short rural",395,2.91786469039707,1.6068550170036999,1.2549615695459684,1.9845481309000001E-3,2.1053929367514268,1,4.9485702167000002E-4,4.9485702166766812E-4,3.5346930119119156E-6,3.5346930119119156E-6,7,0.52499027959421729,0.52499027959421729,1.3219751864550564E-3,"0.0013219751865"]
[null,"KMD2","KIAMA","Short rural",1311,7.9394505829329196,4.1107899999999997,2.9571095591526531,1.8874895519833998,4.6777925747401925,8,0.47065497860780003,0.47065497861510724,4.7046763988547596E-3,4.7046763988547596E-3,14,1.1664310204658725,1.1664310204658725,2.8737054186843873E-3,"0.0028737054187"]
[null,"KME2","KIAMA","Short rural",970,10.8443775374721,4.4103228690886302,2.7789808353001226,4.5285829059740008,2.0613359682449568,10,1.1292248418179898,1.1292248418224877,1.1339295182213426E-2,1.1339295182213426E-2,9,0.51400445371319503,0.51400445371319503,1.6577710225866883E-3,"0.0016577710226"]
[null,"KMF2","KIAMA","Urban",1502,5.6440815698583799,1.3507409273169302,3.3158501903655115,7.9702702918300004,2.0730022761860201,4,0.767902648977,0.76790264897497051,5.0894049786227892E-3,5.0894049786227892E-3,5,0.19972521394252438,0.19972521394252438,6.1867835008180762E-4,"0.00061867835008"]
[null,"KVA2","KANGAROO VALLEY","Short rural",358,64.370883836723692,0.42307,0.90724474890296269,2.9720167548461003,2.0762626052582491,15,0.74108727157346022,0.74108727157044396,4.0260153405656468E-3,4.0260153405656468E-3,13,0.51772648545473821,0.51772648545473821,1.4421547488600616E-3,"0.0014421547489"]
[null,"KVB2","KANGAROO VALLEY","Short rural",394,47.248572070399597,9.126999999999999E-2,1.0253071054495497,0.42377190267510001,0.20412495060912669,11,0.10566964759193,0.10566964759107489,1.9582199285960197E-3,1.9582199285960197E-3,1,5.0899579371531584E-2,5.0899579371531584E-2,1.4138772047647661E-4,"0.00014138772048"]
[null,"KVC2","KANGAROO VALLEY","Short rural",136,38.665672176409601,0,0.26086763622956372,0.19858239118870002,0.3434685800874403,5,4.9517514403710002E-2,4.9517514403869603E-2,7.352161464772365E-4,7.352161464772365E-4,3,8.5645611678625708E-2,8.5645611678625708E-2,3.2519175709589624E-4,"0.0003251917571"]
[null,"KVD2","KANGAROO VALLEY","Short rural",99,32.072028311783598,0,0.29965864611587634,0.65500011061200003,0.75908966007768996,4,0.16332756000189999,0.16332756000140045,1.0992895267032624E-3,1.0992895267032624E-3,5,0.18928281078788306,0.18928281078788306,5.5848149588208268E-4,"0.00055848149588"]
[null,"KYA2","KENNY STREET","Urban",257,0,2.30022727957763,1.8779980274167838,0,0,0,0,0,0,0,0,0,0,0,"0"]
[null,"KYB2","KENNY STREET","Urban",232,0,1.3674900000000001,3.401720073252354,0,0,0,0,0,0,0,0,0,0,0,"0"]
[null,"KYC2","KENNY STREET","Urban",115,0,1.1884100000000002,2.9152701398450196,0,0,0,0,0,0,0,0,0,0,0,"0"]
[null,"KYD2","KENNY STREET","Urban",347,0,1.3751099999999998,2.7414981011237813,0,0,0,0,0,0,0,0,0,0,0,"0"]
[null,"KYE2","KENNY STREET","Urban",419,0,1.5166199999999999,1.8984604756574024,0,4.082499012182534E-2,0,0,0,0,0,1,3.9333193117783794E-3,3.9333193117783794E-3,6.5555321862972992E-5,"6.5555321863e-05"]
[null,"KYF2","KENNY STREET","Urban",401,0.90558907653487297,1.9069272694158301,2.9321253036037476,0,6.1917901684768434E-2,0,0,0,0,0,2,5.9655342895305417E-3,5.9655342895305417E-3,5.7360906630101363E-5,"5.736090663e-05"]
[null,"KYG2","KENNY STREET","Urban",130,0,1.0181900000000002,2.1424729481282512,0,0,0,0,0,0,0,0,0,0,0,"0"]
[null,"KYH2","KENNY STREET","Urban",454,0.54546376101096494,1.4387540004341199,2.9439759952291338,0,2.0361463823260388,0,0,0,0,0,2,0.19617430067494668,0.19617430067494668,3.4416543978060821E-4,"0.00034416543978"]
[null,"L502","SEVEN HILLS","Short rural",24,0.33623000000000003,1.5722400000000001,0.30484094213212237,0,6.967181473915679E-2,0,0,0,0,0,2,1.7373016153547065E-2,1.7373016153547065E-2,7.0693860238238304E-5,"7.0693860238e-05"]
[null,"L503","SEVEN HILLS","Urban",22,0,1.3926700000000001,1.4606961810497539,0,0,0,0,0,0,0,0,0,0,0,"0"]
[null,"L504","SEVEN HILLS","Urban",106,1.2148828139632701,1.42084548050486,1.7842238729345752,1.0248773562E-2,0,1,9.8742703555999996E-4,9.8742703556103061E-4,9.5601511050168944E-6,9.5601511050168944E-6,0,0,0,0,"0"]
[null,"L505","LENNOX","Urban",609,0,1.39103,2.972341444894528,0,0,0,0,0,0,0,0,0,0,0,"0"]
[null,"L506","LENNOX","Urban",5,0,0.98457000000000006,1.3814375360954019,0,0,0,0,0,0,0,0,0,0,0,"0"]
[null,"L507","LENNOX","Urban",288,0,1.01289643582983,0.31869469278143453,0,0,0,0,0,0,0,0,0,0,0,"0"]
[null,"L508","LENNOX","Urban",495,0,1.2536415812834301,2.5533172472044439,9.3415515591000003E-2,0,1,9.0001993974000005E-3,9.0001993974373334E-3,5.1897963141520282E-5,5.1897963141520282E-5,0,0,0,0,"0"]
[null,"L509","BOSSLEY PARK","Urban",1019,1.93647001409159,9.9662180924703208,6.9699239463677909,0.24174631303480001,0.14288746542638869,9,2.3291259563080001E-2,2.3291259563565446E-2,1.5979109704099669E-4,1.5979109704099669E-4,1,1.3766617591224328E-2,1.3766617591224328E-2,3.8240604420067578E-5,"3.824060442e-05"]
[null,"L511","BOSSLEY PARK","Urban",990,0,7.2309558786550499,3.8613186003402231,1.7814579804059001,0.94110107437082791,4,0.17163612426051,0.1716361242601126,1.6265914237250172E-3,1.6265914237250172E-3,3,9.0671204551724519E-2,9.0671204551724519E-2,1.8300860686746627E-4,"0.00018300860687"]
[null,"L513","BOSSLEY PARK","Urban",1272,0,6.1839188860891703,6.2746427255528463,2.0392721112711998,0,3,0.19647545175372999,0.19647545175760475,3.0237265752270401E-3,3.0237265752270401E-3,0,0,0,0,"0"]
[null,"L516","BOSSLEY PARK","Urban",653,0,4.0164142805952201,4.406780659461961,3.3595564788000002E-3,0,1,3.2367940169999998E-4,3.2367940169842913E-4,1.3657358721452706E-6,1.3657358721452706E-6,0,0,0,0,"0"]
[null,"L517","BOSSLEY PARK","Urban",782,5.20199241356325,5.3288473701934498,3.246481728727459,9.2139734650000004E-4,0.30767583701188161,1,8.8772831689000001E-5,8.8772831689442586E-5,1.3657358721452706E-6,1.3657358721452706E-6,2,2.9643297104913098E-2,2.9643297104913098E-2,1.1608754913234801E-4,"0.00011608754913"]
[null,"L519","BOSSLEY PARK","Urban",1038,0.88896000000000008,6.85457929059785,6.9541839923890416,0.84394326801899999,0.43403485157644794,5,8.1310450883799998E-2,8.1310450884040833E-2,1.5528416866291727E-3,1.5528416866291727E-3,1,4.1817466669216041E-2,4.1817466669216041E-2,9.1504303433733133E-5,"9.1504303434e-05"]
[null,"L520","BOSSLEY PARK","Urban",208,0,2.7495123272525004,3.1119179509320767,0,0,0,0,0,0,0,0,0,0,0,"0"]
[null,"L521","BOSSLEY PARK","Urban",27,0.13202479769419501,3.19394,1.7993947904880161,0,6.5490088320428144E-2,0,0,0,0,0,1,6.3096997293111499E-3,6.3096997293111499E-3,1.9120302210033789E-5,"1.912030221e-05"]
[null,"L526","CRANEBROOK","Urban",737,0,7.0897822825522399,3.1627247746207701,6.2513266124000003E-3,0.28775947898369947,1,6.0228951962000002E-4,6.0228951961606436E-4,1.3657358721452706E-6,1.3657358721452706E-6,1,2.7724438204548993E-2,2.7724438204548993E-2,9.5601511050168948E-5,"9.560151105e-05"]
[null,"L528","CRANEBROOK","Urban",592,1.3750218907221199,6.3795795434922402,3.7152489822352415,7.6745311292000004E-2,0.21489821189127506,1,7.3940940117999997E-3,7.3940940117944946E-3,3.2777660931486496E-5,3.2777660931486496E-5,2,2.0704555821722301E-2,2.0704555821722301E-2,6.0092378374391904E-5,"6.0092378374e-05"]
[null,"L533","NEWTON","Urban",283,0.153305915107317,1.93618638615653,3.9121254240288978,1.7010412551000001E-3,0,1,1.6388830466E-4,1.6388830465743247E-4,5.4629434885810824E-6,5.4629434885810824E-6,0,0,0,0,"0"]
[null,"L534","NEWTON","Urban",543,2.3706100000000001,2.5011300000000003,1.4606961810497539,0.11986670710799999,0.61166608463776506,2,1.15486625349E-2,1.1548662534860409E-2,1.5023094593597978E-4,1.5023094593597978E-4,2,5.8931502883068428E-2,5.8931502883068428E-2,1.2701343610951017E-4,"0.00012701343611"]
[null,"L535","NEWTON","Urban",2,0,0.78209000000000006,0.41244979470476162,0,0,0,0,0,0,0,0,0,0,0,"0"]
[null,"L537","NEWTON","Urban",852,3.2923151825071399,0.18431,2.1726318786698497,1.5325531188000001,2.2937123790321383,2,0.147655168079,0.14765516808111379,1.3848561743553043E-3,1.3848561743553043E-3,4,0.22098972147182624,0.22098972147182624,6.8423367194478054E-4,"0.00068423367194"]
[null,"L538","NEWTON","Urban",104,0,0.60063,2.1302056405486116,0,0,0,0,0,0,0,0,0,0,0,"0"]
[null,"L540","NEWTON","Urban",440,2.5219999999999999E-2,2.2678463100648503,2.9531466269049358,0.49532903813899998,0.72464357466239981,2,4.7722908580499997E-2,4.7722908580372189E-2,6.1184967072108124E-4,6.1184967072108124E-4,4,6.9816417784066234E-2,6.9816417784066234E-2,1.857400786117568E-4,"0.00018574007861"]
[null,"L541","NEWTON","Urban",175,0,1.2453699999999999,2.3469170663103371,0.14189519136000001,0,1,1.3671016080000001E-2,1.3671016080174158E-2,4.7800755525084474E-5,4.7800755525084474E-5,0,0,0,0,"0"]
[null,"L543","NEWTON","Urban",723,0.92178880089982995,2.5285892801402201,3.219775756940797,0.18201141429000001,0,1,1.7536048597999999E-2,1.7536048598345275E-2,1.1786300576613685E-3,1.1786300576613685E-3,0,0,0,0,"0"]
[null,"L544","NEWTON","Urban",967,4.1604268042595907,0.47364000000000001,2.1529391538081146,0,0.45162645322269285,0,0,0,0,0,1,4.3512344886548322E-2,4.3512344886548322E-2,8.057841645657097E-5,"8.0578416457e-05"]
[null,"L545","NEWTON","Urban",4,0,0.26347000000000004,3.1386423401923325,0,0,0,0,0,0,0,0,0,0,0,"0"]
[null,"L579","LITHGOW","Short rural",876,4.0005828567365702,3.78688,1.1622060918787167,2.36769267181,0.47203894828360549,2,0.59039603299999999,0.59039603300318777,5.1125681962511677E-3,5.1125681962511677E-3,2,0.11770527729666679,0.11770527729666679,2.6156728288148173E-4,"0.00026156728288"]
[null,"L580","LITHGOW","Urban",139,0.8654400000000001,1.28956,1.0478907385791707,0,0,0,0,0,0,0,0,0,0,0,"0"]
[null,"L582","LITHGOW","Short rural",1250,158.29305605084699,1.64696962629522,1.6575726228434153,2.2286617263712998,1.4301646105489862,18,0.55572797003063001,0.55572797002580321,3.98713371743664E-3,3.98713371743664E-3,21,0.35661871266480505,0.35661871266480505,8.4832632285885971E-4,"0.00084832632286"]
[null,"L584","LITHGOW","Short rural",390,32.532378107283499,3.0209861732825698,2.3434647426406907,0.89480440154270002,0.86730423458811168,6,0.22312396168600002,0.22312396168392776,2.5379095825527553E-3,2.5379095825527553E-3,13,0.21626665724081864,0.21626665724081864,5.5141210985825881E-4,"0.00055141210986"]
[null,"L585","LITHGOW","Short rural",742,7.4356208956948802,1.9671400000000001,0.70494467868053301,0,0,0,0,0,0,0,0,0,0,0,"0"]
[null,"L588","LITHGOW","Short rural",1050,66.44105715649161,2.1895300000000004,2.781673596955617,3.8296400561152706,2.4694866420566641,9,0.95493993956801004,0.9549399395665954,4.5159355681923764E-3,4.5159355681923764E-3,26,0.61577886960517481,0.61577886960517481,1.8557138312537557E-3,"0.0018557138313"]
[null,"L590","LITHGOW","Short rural",77,0.48333999999999999,0.54039999999999999,7.6210235533030593E-2,6.2187233217000003E-2,0.26748873736070977,1,1.5506698243E-2,1.5506698243257573E-2,2.7217136191721747E-4,2.7217136191721747E-4,1,6.6699657134777851E-2,6.6699657134777851E-2,1.3078364144074087E-4,"0.00013078364144"]
[null,"L591","LITHGOW","Short rural",1576,136.02624564244999,5.2646013908457094,2.553042890356525,2.7614561981455004,2.0111552512202131,18,0.68858294157936006,0.68858294157152466,2.9408645859107137E-3,2.9408645859107137E-3,26,0.50149164045102679,0.50149164045102679,1.300767028383585E-3,"0.0013007670284"]
[null,"L940","GLOSSODIA","Short rural",577,40.338402615823604,1.0383800000000001,2.8959889502551626,0.4379897724856,0.70890894305294627,5,0.10921494468189999,0.10921494468205437,4.2416316142942991E-4,4.2416316142942991E-4,5,0.1767699975257149,0.1767699975257149,4.6657947757237282E-4,"0.00046657947757"]
[null,"L941","GLOSSODIA","Short rural",666,32.393201597871403,6.4659999999999995E-2,3.2198824512705428,0.82484907992640011,1.7792891528095545,6,0.20568025166586001,0.20568025167014242,2.0183097098017038E-3,2.0183097098017038E-3,14,0.44367466685518364,0.44367466685518364,1.1982609310381394E-3,"0.001198260931"]
[null,"L942","GLOSSODIA","Short rural",604,23.0348090502833,0.38101275056929201,3.4294605989863767,0.67674508799069999,2.321212545989201,6,0.16874977908342004,0.16874977908168676,2.5555830476123149E-3,2.5555830476123149E-3,11,0.57880598070057621,0.57880598070057621,1.336113958502704E-3,"0.0013361139585"]
[null,"L946","GLOSSODIA","Short rural",505,37.326815099159198,0.21230000000000002,3.2008298923872851,1.2734703602802002,0.35530499215401118,10,0.31754621611150002,0.31754621611113076,6.1645046127743819E-3,6.1645046127743819E-3,7,8.8597080343572165E-2,8.8597080343572165E-2,2.4035912481001025E-4,"0.00024035912481"]
[null,"L947","GLOSSODIA","Short rural",857,19.3332104912541,0.23651,3.7343015411184997,2.0360896809083,6.0732842943732113,8,0.50770916545404998,0.50770916545897982,2.5767912056837866E-3,2.5767912056837866E-3,10,1.514403874023541,1.514403874023541,3.7220317415432472E-3,"0.0037220317415"]
[null,"L948","GLOSSODIA","Short rural",737,21.824760180276201,4.0259999999999997E-2,3.9819848066008485,0.89885854986660008,2.0788850438598248,8,0.22413488388961,0.22413488388533453,4.4784560460923968E-3,4.4784560460923968E-3,10,0.51838040366194194,0.51838040366194194,1.4421547488600616E-3,"0.0014421547489"]
[null,"LL1112","LEABONS LANE","Urban",1066,3.6491139377663,2.55821306860557,3.4547547761597897,0.33076747205400003,0,2,3.1868080840500003E-2,3.1868080840637747E-2,1.2701343610951017E-4,1.2701343610951017E-4,0,0,0,0,"0"]
[null,"LL1122","LEABONS LANE","Urban",72,0,0.69458000000000009,0.20018142567461147,0,0,0,0,0,0,0,0,0,0,0,"0"]
[null,"LL1142","LEABONS LANE","Urban",591,3.0554900723534701,9.570999999999999E-2,1.2765214451782625,0,0.87816254793301385,0,0,0,0,0,2,8.4607337279399508E-2,8.4607337279399508E-2,2.0349464494964531E-4,"0.00020349464495"]
[null,"LL1162","LEABONS LANE","Urban",1496,1.5252902552725101,2.9564626928039002,2.3248745258530068,1.4884110981999999E-2,0.46140744043938015,1,1.4340226658000001E-3,1.4340226657525341E-3,1.3657358721452706E-6,1.3657358721452706E-6,2,4.4454702638328555E-2,4.4454702638328555E-2,1.0925886977162164E-4,"0.00010925886977"]
[null,"LL1172","LEABONS LANE","Urban",630,5.6344268873454206,0.15856000000000001,2.5657445962787029,1.5281020608E-2,3.3906004816803486,1,1.4722632702000001E-3,1.4722632701726017E-3,1.5023094593597976E-5,1.5023094593597976E-5,3,0.3266703632584273,0.3266703632584273,7.2110854049270282E-4,"0.00072110854049"]
[null,"LL1212","LEABONS LANE","Urban",902,2.7464789710317099,2.05151531711559,2.1084831830805193,0.22772689802000001,1.3728111695653387,1,2.1940546785999999E-2,2.1940546786013773E-2,4.7800755525084474E-5,4.7800755525084474E-5,4,0.13226469053790874,0.13226469053790874,3.1275351472126694E-4,"0.00031275351472"]
[null,"LL1222","LEABONS LANE","Urban",1024,5.4597755428290702,6.4310000000000006E-2,2.2609036541465808,0.34203687036700003,2.2288460058385713,3,3.2953840859400001E-2,3.2953840858993236E-2,1.9393449384462843E-4,1.9393449384462843E-4,6,0.21474011412088947,0.21474011412088947,5.1624815967091231E-4,"0.00051624815967"]
[null,"LL1232","LEABONS LANE","Urban",328,1.2088497393675701,1.5217994427694801,2.0513102643836398,2.5841651733000001E-2,1.7435672864529572E-2,1,2.4897364949000001E-3,2.4897364949208285E-3,7.2520574810913869E-4,7.2520574810913869E-4,1,1.6798551227386828E-3,1.6798551227386828E-3,2.7314717442905412E-6,"2.7314717443e-06"]
[null,"LL1242","LEABONS LANE","Urban",825,2.3836418871930198,1.73128939224798,3.3023266840701755,0,1.5544682002636689,0,0,0,0,0,4,0.14976659573945036,0.14976659573945036,3.6601721373493253E-4,"0.00036601721373"]
[null,"LL1252","LEABONS LANE","Urban",8,0,1.9045699999999999,3.4929132410911783,6.1691096183999997E-2,1.3608330040608447E-2,1,5.9436825155999998E-3,5.9436825155762176E-3,1.0925886977162165E-5,1.0925886977162165E-5,1,1.3111064372594598E-3,1.3111064372594598E-3,5.4629434885810824E-6,"5.4629434886e-06"]
[null,"LP1112","LIVERPOOL 11KV","Urban",42,1.9073797875743101,1.01939,3.1303989330488364,0,1.0489754406302345E-2,0,0,0,0,0,1,1.0106445453875001E-3,1.0106445453875001E-3,2.7314717442905412E-6,"2.7314717443e-06"]
[null,"LP1122","LIVERPOOL 11KV","Urban",1,0,2.4112496703465101,3.9599473468258739,0,0,0,0,0,0,0,0,0,0,0,"0"]
[null,"LP1132","LIVERPOOL 11KV","Urban",573,1.77032516655823,2.1698763965049803,2.5932437896001987,0.20864688528209999,0.29626468525907973,4,2.0102266301829999E-2,2.0102266302106236E-2,1.5842536116885138E-4,1.5842536116885138E-4,1,2.8543879727836157E-2,2.8543879727836157E-2,7.5115472967989889E-5,"7.5115472968e-05"]
[null,"LP1142","LIVERPOOL 11KV","Urban",1119,4.8825215578074808,0.83383734045827806,2.613016535209244,0.24537520104130001,0.48295396300367688,4,2.3640887946870002E-2,2.3640887946834634E-2,1.4162680994146456E-3,1.4162680994146456E-3,2,4.6530621163989372E-2,4.6530621163989372E-2,9.8332982794459482E-5,"9.8332982794e-05"]
[null,"LP1152","LIVERPOOL 11KV","Urban",614,0,1.8581506692465499,1.6998801000142818,0,0,0,0,0,0,0,0,0,0,0,"0"]
[null,"LP1162","LIVERPOOL 11KV","Urban",1473,2.7103050272198104,3.16161325091237,3.1501215069194948,7.0451458647999995E-2,0,1,6.7877072846000003E-3,6.7877072845619951E-3,4.7800755525084474E-5,4.7800755525084474E-5,0,0,0,0,"0"]
[null,"LP1212","LIVERPOOL 11KV","Urban",560,0,1.71506510200897,3.6444369717191272,1.0702384563E-2,2.1546522564296709E-2,1,1.0311305834999999E-3,1.0311305834696794E-3,9.5601511050168944E-6,9.5601511050168944E-6,1,2.0759185256608113E-3,2.0759185256608113E-3,2.7314717442905412E-6,"2.7314717443e-06"]
[null,"LP1222","LIVERPOOL 11KV","Urban",183,0,2.6140400000000001,2.0069609879857726,0,0,0,0,0,0,0,0,0,0,0,"0"]
[null,"LP1232","LIVERPOOL 11KV","Urban",435,0,1.5890412547352502,1.0871841009347059,0,0,0,0,0,0,0,0,0,0,0,"0"]
[null,"LP1312","LIVERPOOL 11KV","Urban",1092,4.9563299141133905,0.36525999999999997,2.2935260805517843,0.56892742311,0,2,5.4813809227999999E-2,5.4813809228550434E-2,3.6738294960707779E-4,3.6738294960707779E-4,0,0,0,0,"0"]
[null,"LP1322","LIVERPOOL 11KV","Urban",1019,4.4783131699421705,1.67696,2.5149377725900095,7.7071344198500008E-2,1.5911114639667658,2,7.4255059368799996E-3,7.4255059368538365E-3,6.9652529479408793E-5,6.9652529479408793E-5,5,0.1532970229689459,0.1532970229689459,3.5372559088562509E-4,"0.00035372559089"]
[null,"LP1332","LIVERPOOL 11KV","Urban",370,0.14924595771127203,1.12378063261793,1.8677858558553575,9.7809872166999996E-3,0,1,9.4235775178000002E-4,9.423577517802367E-4,2.7314717442905412E-6,2.7314717442905412E-6,0,0,0,0,"0"]
[null,"LP1342","LIVERPOOL 11KV","Urban",185,0,1.8682799999999999,2.5492323785798736,4.6651056420000003E-2,5.1031237652281675E-3,1,4.4946367552000004E-3,4.4946367552300857E-3,1.5023094593597976E-5,1.5023094593597976E-5,2,4.9166491397229742E-4,4.9166491397229742E-4,8.194415232871624E-6,"8.1944152329e-06"]
[null,"LP1412","LIVERPOOL 11KV","Urban",601,0.41276000000000002,2.8723100000000001,1.5438923548399774,0,0.1888155793134422,0,0,0,0,0,2,1.8191601816975003E-2,1.8191601816975003E-2,3.0046189187195952E-5,"3.0046189187e-05"]
[null,"LP1422","LIVERPOOL 11KV","Urban",1946,5.6968492738130596,3.5682600000000004,4.5397929238789381,5.6535807152864006,2.041249506091267E-2,9,0.54469916936099994,0.54469916935944251,2.9650125784273823E-3,2.9650125784273823E-3,1,1.9666596558891897E-3,1.9666596558891897E-3,4.097207616435812E-6,"4.0972076164e-06"]
[null,"LP1432","LIVERPOOL 11KV","Urban",1572,1.37773757029183,3.9805300000000003,2.4724124611625786,3.7752484355,0.16585152236991546,1,0.36372960615,0.36372960614908917,2.1455710551402203E-3,2.1455710551402203E-3,1,1.5979109704099666E-2,1.5979109704099666E-2,4.0972076164358119E-5,"4.0972076164e-05"]
[null,"LP1442","LIVERPOOL 11KV","Urban",1,0,1.74393,1.6925023141293871,0,0,0,0,0,0,0,0,0,0,0,"0"]
[null,"M158","WOODPARK","Urban",7,0.499931488743658,1.4014404808948999,3.0230060094768865,9.1257961295999998E-4,0,1,8.7923279453999998E-5,8.7923279453661944E-5,1.2044284856666022E-6,1.2044284856666022E-6,0,0,0,0,"0"]
[null,"M159","WOODPARK","Urban",84,1.3448314458391102,0.79260104915459895,1.3199816021615662,0.21468558172999999,2.3318440538334265E-2,2,2.0684069784000003E-2,2.0684069783640124E-2,4.2337812036503386E-5,4.2337812036503386E-5,2,2.2466355096789703E-3,2.2466355096789703E-3,2.7314717442905412E-6,"2.7314717443e-06"]
[null,"M160","WOODPARK","Urban",61,2.9040326379459596,1.3992505574604299,2.8324804206443104,2.3616122757700003E-2,6.1520992058584023E-2,2,2.2753159630400002E-3,2.2753159629940209E-3,1.3657358721452707E-5,1.3657358721452707E-5,1,5.9272936851104746E-3,5.9272936851104746E-3,9.5601511050168944E-6,"9.560151105e-06"]
[null,"M162","WOODPARK","Urban",94,1.67134344378628,2.3003449853098399,3.5653688523536089,0,6.5490088320428144E-2,0,0,0,0,0,1,6.3096997293111499E-3,6.3096997293111499E-3,1.5023094593597976E-5,"1.5023094594e-05"]
[null,"M163","WOODPARK","Urban",11,0.47316000000000003,0.68615386450675708,1.8163439468705618,0,0,0,0,0,0,0,0,0,0,0,"0"]
[null,"M165","WOODPARK","Urban",50,0,1.5551784801750299,1.7718879761429611,0,5.2165265155665712E-2,0,0,0,0,0,3,5.025908009494596E-3,5.025908009494596E-3,3.0046189187195952E-5,"3.0046189187e-05"]
[null,"M166","WOODPARK","Urban",62,1.39354524451979,0.951703718635453,4.566263279020756,2.1943432190000001E-2,0.16067752188572579,1,2.1141591300999998E-3,2.1141591300808788E-3,1.6388830465743248E-5,1.6388830465743248E-5,4,1.5480616110766642E-2,1.5480616110766642E-2,3.4143396803631763E-5,"3.4143396804e-05"]
[null,"M168","WOODPARK","Urban",326,2.6958519403219898,0.96443191290143704,3.5120216874804875,3.2319783845999998E-3,7.7964390857652556E-3,1,3.1138777885E-4,3.1138777884912169E-4,1.3657358721452706E-6,1.3657358721452706E-6,1,7.5115472967989883E-4,7.5115472967989883E-4,1.3657358721452706E-6,"1.3657358721e-06"]
[null,"M169","WOODPARK","Urban",120,0.56207750041975102,0.90026342535414905,1.3209774159058629,1.5644221936E-2,0,1,1.5072562192E-3,1.5072562192104189E-3,2.0647345468635877E-5,2.0647345468635877E-5,0,0,0,0,"0"]
[null,"M170","WOODPARK","Urban",10,0,2.3959999999999999,0.83155464822744507,0,0,0,0,0,0,0,0,0,0,0,"0"]
[null,"M388","MACQUARIE FIELDS","Urban",944,2.0995238818291799,4.3979799999999996,3.3532503634533462,4.9471949834999996E-3,3.0760496029292012E-2,1,4.7664181938000003E-4,4.7664181937869942E-4,1.3657358721452706E-6,1.3657358721452706E-6,1,2.9636468425552373E-3,2.9636468425552373E-3,9.5601511050168944E-6,"9.560151105e-06"]
[null,"M399","LITHGOW","Short rural",1091,25.511983877656903,0.96870356633730703,1.1812586507619742,4.8003525971481,2.8492441022523938,7,1.1969919762415702,1.1969919762468628,7.8929694955993078E-3,7.8929694955993078E-3,12,0.71047329539429505,0.71047329539429505,1.6436322505390406E-3,"0.0016436322505"]
[null,"M400","LITHGOW","Urban",752,3.7578747699610897,4.2671392256322198,2.5911480081230405,0,0.54858580476202801,0,0,0,0,0,5,5.2853978252021969E-2,5.2853978252021969E-2,1.3384211547023652E-4,"0.00013384211547"]
[null,"MG1204","MITTAGONG","Short rural",249,0,6.1883699999999999,0.53162164526364997,0,0.22751426786642248,0,0,0,0,0,4,5.673182284118624E-2,5.673182284118624E-2,1.0957548336926938E-4,"0.00010957548337"]
[null,"MG1208","MITTAGONG","Short rural",803,8.0819187554492906,1.11708576476481,3.2911542635410327,3.2773394847454003,0.4316392184755492,5,0.81722102436287003,0.81722102435403476,6.8184228199780856E-3,6.8184228199780856E-3,1,0.10763140221271783,0.10763140221271783,2.4742851083383406E-4,"0.00024742851083"]
[null,"MG1219","MITTAGONG","Short rural",580,38.943823407081901,2.3021599999999998,1.9533089821705187,0.12020691535859999,1.8775242852901968,4,2.9974196741000003E-2,2.9974196741013044E-2,3.7821215227457501E-4,3.7821215227457501E-4,11,0.46817008942773319,0.46817008942773319,1.0109222014068077E-3,"0.0010109222014"]
[null,"MG1234","MITTAGONG","Urban",1201,8.032234458751029,5.7603,2.7245159203058438,2.2688771767200002,0.59068657582516038,2,0.218596952224,0.21859695222382775,3.28049756489294E-3,3.28049756489294E-3,2,5.6910213792293426E-2,5.6910213792293426E-2,1.3930505895881761E-4,"0.00013930505896"]
[null,"MG1267","MITTAGONG","Short rural",1287,45.746381363024,2.7850555436229301,2.664424149588049,9.1041712520415992,5.5376405784935541,13,2.2701707256714601,2.2701707256724752,1.2109858258810223E-2,1.2109858258810223E-2,22,1.3808384291824256,1.3808384291824256,3.4463256866141176E-3,"0.0034463256866"]
[null,"MG1282","MITTAGONG","Short rural",1443,37.694352754067204,2.88943853170082,2.9491709929512893,0.35276760561393994,1.6182572473290211,14,8.7964370294420002E-2,8.7964370294439931E-2,4.1214520518892935E-3,4.1214520518892935E-3,13,0.40352055423986427,0.40352055423986427,1.134636456823725E-3,"0.0011346364568"]
[null,"MG1286","MITTAGONG","Short rural",1407,32.920215504821201,2.5624499999999997,2.0100449621836822,1.6230768642301001,2.54205022692945,12,0.40472234986338995,0.40472234986391431,2.4495422572549568E-3,2.4495422572549568E-3,11,0.63387296313315189,0.63387296313315189,1.6082853204199216E-3,"0.0016082853204"]
[null,"MM1102","MAMRE","Urban",8,0,4.3044899999999995,1.3908367984778085,0,2.1263015688450699E-4,0,0,0,0,0,1,2.0486038082179059E-5,2.0486038082179059E-5,4.097207616435812E-6,"4.0972076164e-06"]
[null,"MM1112","MAMRE","Urban",554,5.9982856189310798,6.1986776504361396,3.6199861878189532,0.17339280527000001,0.56984882045047869,3,1.67056811884E-2,1.670568118808095E-2,3.5509132675777037E-5,3.5509132675777037E-5,3,5.4902582060239881E-2,5.4902582060239881E-2,1.6525404052957775E-4,"0.00016525404053"]
[null,"MM1122","MAMRE","Urban",16,0,5.0810399999999998,3.9438796888343335,0.10201994926999999,0,1,9.8292010717999992E-3,9.829201071829512E-3,1.5023094593597976E-5,1.5023094593597976E-5,0,0,0,0,"0"]
[null,"MM1132","MAMRE","Urban",1,0,1.4343299999999999,2.0386238005085686,0,0,0,0,0,0,0,0,0,0,0,"0"]
[null,"MM1142","MAMRE","Urban",1238,0,11.725970038517101,4.0200899243673645,1.0151955963717201,9.0580446832799977E-2,6,9.7809905955849014E-2,9.780990595542785E-2,1.8082342947203381E-3,1.8082342947203381E-3,7,8.7270522230082793E-3,8.7270522230082793E-3,2.185177395432433E-5,"2.1851773954e-05"]
[null,"MM1162","MAMRE","Urban",758,0,7.6688758927474403,5.334716487312142,6.8750417392999998E-3,0,1,6.6238189799000004E-4,6.6238189799045627E-4,1.3657358721452706E-6,1.3657358721452706E-6,0,0,0,0,"0"]
[null,"MM1182","MAMRE","Urban",2,0,2.3775500000000003,2.3244121837574334,0,0,0,0,0,0,0,0,0,0,0,"0"]
[null,"MM1192","MAMRE","Short rural",247,2.7352889438630399,18.536619999999999,2.0767289182750837,0.28285481003099999,0.28577493085277739,2,7.0531264359899995E-2,7.0531264359690357E-2,9.7557527128768861E-4,9.7557527128768861E-4,1,7.1259411120144209E-2,7.1259411120144209E-2,1.4845710650030045E-4,"0.0001484571065"]
[null,"MM1202","MAMRE","Urban",1413,0,10.589927859269899,5.410926722845173,1.3188881617537001,0.27556868332232104,2,0.12706943127674999,0.1270694312802681,1.9325162590855579E-3,1.9325162590855579E-3,1,2.654990535450406E-2,2.654990535450406E-2,7.3749737095844608E-5,"7.3749737096e-05"]
[null,"MM1212","MAMRE","Urban",7,0,1.9464399999999999,3.4104080401031194,0,0,0,0,0,0,0,0,0,0,0,"0"]
[null,"MM1222","MAMRE","Urban",946,4.8590000000000001E-2,7.7678996403285803,3.8867220121845607,0.60589671970759995,0,3,5.8375648382810001E-2,5.83756483831053E-2,1.6935124814601354E-4,1.6935124814601354E-4,0,0,0,0,"0"]
[null,"MM1232","MAMRE","Urban",8,0,3.5761799999999999,1.0097856208126554,0,0,0,0,0,0,0,0,0,0,0,"0"]
[null,"MM1242","MAMRE","Urban",6,0,2.2767900000000001,1.143153532995459,0,0,0,0,0,0,0,0,0,0,0,"0"]
[null,"MM1252","MAMRE","Urban",645,0.14061000000000001,4.71264051370194,2.667358243656071,3.1284983749200003E-2,0,3,3.0141790698400002E-3,3.0141790698246123E-3,7.1018265351554074E-5,7.1018265351554074E-5,0,0,0,0,"0"]
[null,"MM1262","MAMRE","Urban",6,0,6.0330500000000002,2.1148340360415991,0,0,0,0,0,0,0,0,0,0,0,"0"]
[null,"MM1282","MAMRE","Urban",6,0,3.8396699999999999,1.6385200639601578,0,0,0,0,0,0,0,0,0,0,0,"0"]
[null,"MM1292","MAMRE","Urban",8,0,2.5854200000000001,2.6483056847728133,0,0,0,0,0,0,0,0,0,0,0,"0"]
[null,"MM1332","MAMRE","Urban",5,0,2.5964099999999997,2.0195712416253109,0,0,0,0,0,0,0,0,0,0,0,"0"]
[null,"MM1342","MAMRE","Urban",7,0,3.3738299999999999,1.0478907385791707,0,0,0,0,0,0,0,0,0,0,0,"0"]
[null,"MM1352","MAMRE","Short rural",32,0.92535999999999996,2.33839,0.49536653096469885,0,8.5052062753802789E-3,0,0,0,0,0,1,2.1208158071471493E-3,2.1208158071471493E-3,3.5346930119119156E-6,"3.5346930119e-06"]
[null,"MM1362","MAMRE","Urban",206,4.8696392778004105,8.0294553739169903,4.0963001599003945,8.2954111872799996E-2,0.23814577571064782,6,7.9922863237900012E-3,7.9922863237941229E-3,5.0532227269375021E-5,5.0532227269375021E-5,1,2.2944362652040546E-2,2.2944362652040546E-2,4.7800755525084474E-5,"4.7800755525e-05"]
[null,"MM1372","MAMRE","Urban",911,0,7.2919356364180805,3.8486168944180452,0.39965964288100003,0,2,3.8505557178900002E-2,3.8505557179263759E-2,5.3263699013665549E-5,5.3263699013665549E-5,0,0,0,0,"0"]
[null,"MM1382","MAMRE","Urban",488,0,6.6250291278160001,3.2579875690370579,0,3.8273428239211258E-3,0,0,0,0,0,1,3.6874868547922304E-4,3.6874868547922304E-4,1.3657358721452706E-6,"1.3657358721e-06"]
[null,"MM1392","MAMRE","Urban",645,0,4.9486949774092199,2.667358243656071,1.771917974E-3,0,1,1.7071698401999999E-4,1.7071698401815882E-4,1.3657358721452706E-6,1.3657358721452706E-6,0,0,0,0,"0"]
[null,"MR2205","MUNGERIE PARK","Short rural",1113,3.8266064088860396,18.74015,3.8555266224396938,2.8676720491699999E-2,1.1034087607926681,3,7.1506839631000005E-3,7.1506839630978052E-3,1.5199179951221238E-4,1.5199179951221238E-4,21,0.27514050404722351,0.27514050404722351,6.5038351419179248E-4,"0.00065038351419"]
[null,"MR2206","MUNGERIE PARK","Urban",1114,0,14.853069999999999,7.3098215968451257,0,0.96286022709200914,0,0,0,0,0,8,9.2767609115467511E-2,9.2767609115467511E-2,5.8863216089461161E-4,"0.00058863216089"]
[null,"MR2217","MUNGERIE PARK","Urban",119,0,2.6395399999999998,2.2485588661608165,0.32915148286000001,0,1,3.1712386951000003E-2,3.171238695121318E-2,4.0972076164358119E-5,4.0972076164358119E-5,0,0,0,0,"0"]
[null,"MR2218","MUNGERIE PARK","Short rural",204,5.8599700000000006,14.93112,0.97270680088465034,0.27060731299980001,2.1101416769218475,3,6.7477289597500004E-2,6.747728959739846E-2,9.9324873634724833E-4,9.9324873634724833E-4,6,0.52617440175320773,0.52617440175320773,9.7557527128768861E-4,"0.00097557527129"]
[null,"MR2224","MUNGERIE PARK","Short rural",1601,2.3331146702041403,19.730799999999999,5.8851982606143292,1.6193912747999999,4.1747805002704101,1,0.40380332967999999,0.40380332968081722,6.5992718532395462E-3,6.5992718532395462E-3,12,1.0410024389381782,1.0410024389381782,1.9299423845039057E-3,"0.0019299423845"]
[null,"MR2225","MUNGERIE PARK","Urban",2287,0.30612929193794702,16.899849681849197,8.6685179986574585,0,0.32092978345768253,0,0,0,0,0,4,3.0920260145368927E-2,3.0920260145368927E-2,1.4203653070310815E-4,"0.0001420365307"]
[null,"MR2231","MUNGERIE PARK","Urban",1176,0,14.223609282498701,5.4540312320626549,0,0,0,0,0,0,0,0,0,0,0,"0"]
[null,"MR2232","MUNGERIE PARK","Short rural",644,27.672047492219701,7.4772700000000007,4.2003017279911248,3.2997657249026,2.6322904655112351,11,0.82281311972171001,0.82281311972486215,5.7391280492601459E-3,5.7391280492601459E-3,13,0.65637481884698312,0.65637481884698312,1.7920893570393412E-3,"0.001792089357"]
[null,"MR2244","MUNGERIE PARK","Urban",134,0,5.8563000000000001,4.0436947746531411,0,0,0,0,0,0,0,0,0,0,0,"0"]
[null,"MR2272","MUNGERIE PARK","Short rural",192,4.4193199999999999,10.81851,0.91112893057396172,0.101452935521,0.1399106432300056,2,2.5297797886099999E-2,2.5297797886253581E-2,1.1098936057403414E-3,1.1098936057403414E-3,2,3.4887420027570608E-2,3.4887420027570608E-2,1.5906118553603619E-4,"0.00015906118554"]
[null,"MR2291","MUNGERIE PARK","Urban",210,0,4.8848680065030807,3.0111375354632046,0,9.3557269029183078E-3,0,0,0,0,0,1,9.0138567561587855E-4,9.0138567561587855E-4,1.3657358721452706E-6,"1.3657358721e-06"]
[null,"MR2292","MUNGERIE PARK","Urban",1265,1.2703599999999999,7.7528100000000002,5.5552790703094823,0.36457566699099997,1.3793318277097968,3,3.5125360896199997E-2,3.5125360895704213E-2,1.8314518045468079E-3,1.8314518045468079E-3,3,0.13289292903909555,0.13289292903909555,3.8377178007282104E-4,"0.00038377178007"]
[null,"MR2298","MUNGERIE PARK","Urban",1200,0,15.321914174879101,7.5500972274336648,1.4152796532979002,0,3,0.13635635367196,0.13635635367436158,1.7417820716872793E-3,1.7417820716872793E-3,0,0,0,0,"0"]
[null,"MR2299","MUNGERIE PARK","Urban",1468,0,11.362837056124299,8.9344612365735223,0,7.9948938988574622E-2,0,0,0,0,0,1,7.7027503188993257E-3,7.7027503188993257E-3,6.4189585990827712E-5,"6.4189585991e-05"]
[null,"MS1112","MARSDEN PARK","Urban",372,0,5.1584300000000001,0.20322729475474888,0,0,0,0,0,0,0,0,0,0,0,"0"]
[null,"MS1122","MARSDEN PARK","Short rural",480,1.14581,10.096123871323499,1.5750115343492999,0,9.1430967460338006E-3,0,0,0,0,0,1,2.2798769926831853E-3,2.2798769926831853E-3,3.5346930119119156E-6,"3.5346930119e-06"]
[null,"MS1132","MARSDEN PARK","Short rural",24,0,7.1352900000000004,0.20957814771583413,0,0,0,0,0,0,0,0,0,0,0,"0"]
[null,"MS1142","MARSDEN PARK","Short rural",0,0,0,0.32562601370316363,0,2.041249506091267E-2,0,0,0,0,0,1,5.089957937153158E-3,5.089957937153158E-3,1.4138772047647663E-5,"1.4138772048e-05"]
[null,"MS1202","MARSDEN PARK","Short rural",153,3.6578227058660602,5.0606956476774103,0.91452282639636717,0,0,0,0,0,0,0,0,0,0,0,"0"]
[null,"MVB2","MOSS VALE","Short rural",1179,132.37643782255,0.92967999999999995,3.1423512383216123,2.1714358634883104,1.2440706972436657,31,0.54145841433705988,0.54145841433671493,5.4964476335230281E-3,5.4964476335230281E-3,17,0.31021526280442546,0.31021526280442546,7.4582022551341416E-4,"0.00074582022551"]
[null,"MVC2","MOSS VALE","Short rural",770,73.413624573774797,0.25714999999999999,1.4019228474066805,0.57184754392899995,1.0598762800065136,15,0.14259305079293999,0.14259305079353857,1.4881057580149162E-3,1.4881057580149162E-3,9,0.26428546180764201,0.26428546180764201,6.8926513732282346E-4,"0.00068926513732"]
[null,"MVD2","MOSS VALE","Short rural",1688,22.371314971780098,5.4379906494712609,3.6771438644687269,2.1178955899643999,0.8240127346464261,12,0.5281078788261,0.52810787883072352,6.4048637375843914E-3,6.4048637375843914E-3,6,0.20547170478243965,0.20547170478243965,4.9132232865575624E-4,"0.00049132232866"]
[null,"MVE2","MOSS VALE","Short rural",494,13.143722953368501,2.6309325794861804,2.9336685608732909,2.4121190257334,0.47328637853732797,10,0.60147396698824995,0.60147396698596722,7.0234350146689785E-3,7.0234350146689785E-3,4,0.11801633028171503,0.11801633028171503,2.8984482697677708E-4,"0.00028984482698"]
[null,"MVF2","MOSS VALE","Short rural",1088,83.350265234362411,7.0638399999999999,2.0228419309002765,1.86344816885659,0.56186810189541359,15,0.4646601392644199,0.46466013926690469,4.1461949029726773E-3,4.1461949029726773E-3,10,0.14010462691315259,0.14010462691315259,3.958856173341345E-4,"0.00039588561733"]
[null,"MVG2","MOSS VALE","Urban",12,2.8158563696720997,1.6169,3.3615636299794014,0,0,0,0,0,0,0,0,0,0,0,"0"]
[null,"MVH2","MOSS VALE","Short rural",1509,48.894996839477599,2.5247100000000002,2.6815651017300262,0.77190417087009988,0.50764741188986429,13,0.19247817327319,0.19247817327065145,5.5848149588208268E-4,5.5848149588208268E-4,4,0.12658442614258952,0.12658442614258952,3.499346081792796E-4,"0.00034993460818"]
[null,"MYB2","MOUNT OUSLEY","Urban",39,0,1.7158399999999998,3.4235238216383537,0,0,0,0,0,0,0,0,0,0,0,"0"]
[null,"MYC2","MOUNT OUSLEY","Urban",1148,3.7366909819493497,2.4823144485783399,2.8290014233922274,0,2.1771343516842592,0,0,0,0,0,3,0.20975790965930352,0.20975790965930352,4.5752151716866565E-4,"0.00045752151717"]
[null,"MYE2","MOUNT OUSLEY","Short rural",405,6.2812714347912495,1.2649699999999999,0.92961753371427658,1.1000066782799999E-2,0.83309913001729063,2,2.7429217773000001E-3,2.7429217772436463E-3,2.4742851083383406E-5,2.4742851083383406E-5,3,0.20773744300307517,0.20773744300307517,6.2564066310840901E-4,"0.00062564066311"]
[null,"MYF2","MOUNT OUSLEY","Urban",3,0,2.77041,1.8786839195365808,0,0,0,0,0,0,0,0,0,0,0,"0"]
[null,"MYG2","MOUNT OUSLEY","Urban",1653,5.9730586294619297,3.5271699999999999,2.7698610104479973,0.23854268533459999,2.0507469864321082,2,2.298260325685E-2,2.2982603256460614E-2,3.2094792995413857E-4,3.2094792995413857E-4,4,0.19758100862325631,0.19758100862325631,7.2520574810913869E-4,"0.00072520574811"]
[null,"MYK2","MOUNT OUSLEY","Urban",659,1.64865558229388,2.8253000000000004,2.5957714290787171,0,0.37295329517542525,0,0,0,0,0,2,3.593251079614207E-2,3.593251079614207E-2,1.2564770023736489E-4,"0.00012564770024"]
[null,"MYM2","MOUNT OUSLEY","Urban",1362,7.62912784694021,0.86084000000000005,2.479593370605679,7.3938593221000007E-2,0.17563250958660276,1,7.1236783091000004E-3,7.1236783091097313E-3,9.9698718666604749E-5,9.9698718666604749E-5,1,1.6921467455879902E-2,1.6921467455879902E-2,8.057841645657097E-5,"8.0578416457e-05"]
[null,"MYP2","MOUNT OUSLEY","Urban",7,0,1.87138,1.5079350955449027,0,0,0,0,0,0,0,0,0,0,0,"0"]
[null,"MYQ2","MOUNT OUSLEY","Short rural",1930,8.9038019450563812,2.39708888742532,2.877947447163316,1.3819117402355101,2.3515194310171394,5,0.34458661765253001,0.3445866176522569,7.4970838782651723E-3,7.4970838782651723E-3,3,0.58636315436004383,0.58636315436004383,1.3537874235622636E-3,"0.0013537874236"]
[null,"NA1207","NOWRA","Short rural",1375,35.6443449099039,2.4166685426013199,3.807139473729193,2.9311350633479996,7.6889899798196186,9,0.73089321692519993,0.73089321692411025,8.5044713866600681E-3,8.5044713866600681E-3,22,1.9172881835212612,1.9172881835212612,4.3264642465801846E-3,"0.0043264642466"]
[null,"NA1214","NOWRA","Urban",634,3.3257699999999999,0.86469000000000007,3.1853973196918464,6.3377962095000004E-2,0.29087805461800553,1,6.1062050844E-3,6.1062050843615047E-3,6.9652529479408807E-5,6.9652529479408807E-5,1,2.8024900096420953E-2,2.8024900096420953E-2,7.7846944712280423E-5,"7.7846944712e-05"]
[null,"NA1218","NOWRA","Urban",703,4.0187100000000004,1.5424800000000001,2.7873893646205943,0,2.8892185717466807,0,0,0,0,0,4,0.27836428546064906,0.27836428546064906,5.3673419775309133E-4,"0.00053673419775"]
[null,"NA1225","NOWRA","Short rural",442,28.082280720277797,0.83129704620466205,1.7483898201869446,3.9506683148800001E-2,1.731050457884356,3,9.8511894242000013E-3,9.8511894241985094E-3,6.0089781202502562E-5,6.0089781202502562E-5,9,0.43164610653564739,0.43164610653564739,1.0780813686331343E-3,"0.0010780813686"]
[null,"NA1236","NOWRA","Urban",1391,3.48285,6.4544599146029604,2.6036845918682245,0.15051380038700002,0.97724820104119414,2,1.45013834905E-2,1.4501383490438485E-2,1.1199034151591218E-4,1.1199034151591218E-4,4,9.4153831025694953E-2,9.4153831025694953E-2,2.4310098524185818E-4,"0.00024310098524"]
[null,"NA1266","NOWRA","Urban",460,3.7042199999999998,0.51661999999999997,2.1612333677752864,0.66144989204000004,0.56772251888163361,1,6.3727967265999996E-2,6.3727967266042615E-2,6.3096997293111501E-4,6.3096997293111501E-4,2,5.4697721679418089E-2,5.4697721679418089E-2,1.2701343610951017E-4,"0.00012701343611"]
[null,"NA1270","NOWRA","Short rural",750,57.964155992451104,3.7587054437188798,1.9160205840948055,1.1734066084385999,2.5001337353356177,10,0.29259481814064997,0.29259481814004451,1.4386200558481497E-3,1.4386200558481497E-3,22,0.62342087589692841,0.62342087589692841,1.7744158919797816E-3,"0.001774415892"]
[null,"NA1281","NOWRA","Urban",1848,4.0163599999999997,7.1530100000000001,3.6777281429411528,2.4088728720042001,2.2823154026231287,5,0.23208495969244,0.23208495969713444,2.8666795956329232E-3,2.8666795956329232E-3,5,0.21989166983062144,0.21989166983062144,5.831692174060306E-4,"0.00058316921741"]
[null,"NA1285","NOWRA","Urban",359,3.4056899999999999,0.98999000000000004,2.6103021806536688,0.51561395509999997,0,1,4.9677276612999997E-2,4.9677276613412071E-2,4.9166491397229742E-4,4.9166491397229742E-4,0,0,0,0,"0"]
[null,"NA1288","NOWRA","Urban",426,2.0357400000000001,1.5363800000000001,2.4037851440650848,0,0.33935773038767314,0,0,0,0,0,2,3.269571677915778E-2,3.269571677915778E-2,6.1458114246537178E-5,"6.1458114247e-05"]
[null,"NE1212","NORTH EASTERN CREEK","Urban",29,0,4.0159099999999999,4.6002022372447922,0,1.0773261282148354E-3,0,0,0,0,0,1,1.0379592628304056E-4,1.0379592628304056E-4,1.3657358721452706E-6,"1.3657358721e-06"]
[null,"NE1216","NORTH EASTERN CREEK","Short rural",17,1.92362510184881,4.9478299999999997,1.1817495716958668,0,7.1443732713194347E-2,0,0,0,0,0,1,1.7814852780036052E-2,1.7814852780036052E-2,2.8277544095295325E-5,"2.8277544095e-05"]
[null,"NE1219","NORTH EASTERN CREEK","Urban",16,0,6.6222500000000002,2.4310722188976861,0,2.4098084446910791E-4,0,0,0,0,0,1,2.32175098264696E-5,2.32175098264696E-5,1.3657358721452706E-6,"1.3657358721e-06"]
[null,"NE1241","NORTH EASTERN CREEK","Urban",12,0.85078999999999994,2.8864200000000002,2.1655392460829024,0,0,0,0,0,0,0,0,0,0,0,"0"]
[null,"NE1249","NORTH EASTERN CREEK","Urban",2,0,0.55880999999999992,0.684910277929492,0,0,0,0,0,0,0,1,0,0,2.7314717442905412E-6,"2.7314717443e-06"]
[null,"NE1275","NORTH EASTERN CREEK","Urban",2,0,2.4678599999999999,1.1946291015009491,0,8.5052062753802789E-3,0,0,0,0,0,1,8.1944152328716237E-4,8.1944152328716237E-4,1.3657358721452706E-6,"1.3657358721e-06"]
[null,"NE1279","NORTH EASTERN CREEK","Urban",9,0.31547000000000003,2.08711,1.221895218518779,0,2.5515618826140837E-2,0,0,0,0,0,1,2.458324569861487E-3,2.458324569861487E-3,4.097207616435812E-6,"4.0972076164e-06"]
[null,"NE1282","NORTH EASTERN CREEK","Urban",15,9.4980000000000009E-2,2.0354700000000001,1.1050484152289437,0,0,0,0,0,0,0,0,0,0,0,"0"]
[null,"NG1210","NORTH WARRAGAMBA","Short rural",718,38.187340915247795,3.3469699999999998,3.1627247746207701,2.7992988464917801,1.9945984496708062,11,0.69801919557909009,0.69801919557226588,3.593883479625623E-3,3.593883479625623E-3,6,0.4973631190131137,0.4973631190131137,1.0604079035735747E-3,"0.0010604079036"]
[null,"NG1247","NORTH WARRAGAMBA","Urban",891,9.1533692923747694,8.5190000000000002E-2,3.0103043035547086,0.26804157576940002,0.44409934566898129,4,2.5824699606700002E-2,2.582469960639492E-2,1.297449078538007E-4,1.297449078538007E-4,3,4.2787139138439186E-2,4.2787139138439186E-2,1.024301904108953E-4,"0.00010243019041"]
[null,"NG1262","NORTH WARRAGAMBA","Short rural",362,10.0028572995661,0.73163999999999996,2.0957814771583414,1.1680483284999999E-2,0.72804565717255187,1,2.9125870418E-3,2.9125870418154182E-3,2.8277544095295325E-5,2.8277544095295325E-5,2,0.18154183309179597,0.18154183309179597,4.9132232865575624E-4,"0.00049132232866"]
[null,"NG1299","NORTH WARRAGAMBA","Short rural",483,27.4731813149236,3.8143713073095,1.0669432974624284,0.62768422312659988,0.40321765417198674,5,0.15651620656529999,0.15651620656745963,9.5790180622812911E-4,9.5790180622812911E-4,4,0.10054434272383443,0.10054434272383443,3.1105298504824857E-4,"0.00031105298505"]
[null,"NM1210","NORTHMEAD","Urban",336,2.1739306048876603,1.5836102236313301,2.3014068539911894,1.4742357544000001E-2,8.6115213538225321E-2,1,1.4203653069999999E-3,1.4203653070310814E-3,1.3657358721452706E-5,1.3657358721452706E-5,2,8.296845423282519E-3,8.296845423282519E-3,1.9120302210033789E-5,"1.912030221e-05"]
[null,"NM1213","NORTHMEAD","Urban",659,3.8039284883022799,1.5566600000000002,2.4821673713108066,0.39549209181,2.9130331493177456E-2,1,3.8104030832999999E-2,3.8104030832853047E-2,9.000199397437333E-4,9.000199397437333E-4,2,2.8065872172585312E-3,2.8065872172585312E-3,1.0925886977162165E-5,"1.0925886977e-05"]
[null,"NM1221","NORTHMEAD","Urban",762,5.1078111157298203,7.5689999999999993E-2,2.9112614814559823,0.65426671025400007,0,5,6.3035897346500003E-2,6.3035897346908273E-2,5.3645705788558961E-4,5.3645705788558961E-4,0,0,0,0,"0"]
[null,"NM1228","NORTHMEAD","Urban",567,7.9480000000000009E-2,2.8773499999999999,1.6155045728291826,0,0,0,0,0,0,0,0,0,0,0,"0"]
[null,"NM1236","NORTHMEAD","Urban",397,2.8984310813687397,0.51588000000000001,2.8642245240849959,0.59476535732000002,0,2,5.7303187556000001E-2,5.7303187555381878E-2,7.2958009559253266E-4,7.2958009559253266E-4,0,0,0,0,"0"]
[null,"NM1239","NORTHMEAD","Urban",1208,4.6183539633115496,1.2948,3.1598726065559464,3.007568517088,6.6978499418619705E-2,6,0.28976681426170003,0.28976681425718986,3.7339218744451698E-3,3.7339218744451698E-3,1,6.4531019958864039E-3,6.4531019958864039E-3,6.1458114246537178E-5,"6.1458114247e-05"]
[null,"NM1243","NORTHMEAD","Urban",1244,3.2427527039493396,3.0710883954963202,4.0618632948041959,0.35811171022800004,2.0554248498835673E-3,4,3.4502585338299994E-2,3.4502585338005973E-2,2.0212890907750006E-4,2.0212890907750006E-4,1,1.9803170146106424E-4,1.9803170146106424E-4,1.3657358721452706E-6,"1.3657358721e-06"]
[null,"NM1254","NORTHMEAD","Urban",0,0.57567829650757507,0.78185000000000004,4.0918901276042101,1.4458850668E-3,0,1,1.3930505895999999E-4,1.3930505895881761E-4,1.3657358721452706E-6,1.3657358721452706E-6,0,0,0,0,"0"]
[null,"NM1258","NORTHMEAD","Urban",1924,6.0696571398991601,1.0807955495681298,4.0344206240740599,0.38398171264809999,3.7422907611673231E-2,5,3.6995053304950003E-2,3.6995053304671087E-2,4.13817969260017E-4,4.13817969260017E-4,1,3.6055427024635142E-3,3.6055427024635142E-3,3.0046189187195952E-5,"3.0046189187e-05"]
[null,"NN1207","NEPEAN 11KV","Short rural",1371,0.99391999999999991,17.011200000000002,4.210615513199941,1.091501472E-2,1.4595642735742174,2,2.7217136191899998E-3,2.7217136191721751E-3,4.9485702166766813E-5,4.9485702166766813E-5,6,0.36394966597151035,0.36394966597151035,6.645222862394401E-4,"0.00066452228624"]
[null,"NN1214","NEPEAN 11KV","Short rural",904,2.4408146713646302,9.3944521630184905,3.3532503634533462,0,0.12531003912393612,0,0,0,0,0,2,3.1246686225301332E-2,3.1246686225301332E-2,2.262203527623626E-4,"0.00022622035276"]
[null,"NN1233","NEPEAN 11KV","Short rural",771,35.901370898635498,10.480829999999999,4.6488243675148668,3.1725269928170801,0.66042926728327866,12,0.79108550422495016,0.79108550422395829,9.5931568343289395E-3,9.5931568343289395E-3,8,0.16468134742497614,0.16468134742497614,4.7011417058428475E-4,"0.00047011417058"]
[null,"NN1236","NEPEAN 11KV","Urban",1094,0,10.18919,3.5818810700524382,1.5592878172000001E-4,9.5442589753559029E-2,1,1.5023094594E-5,1.5023094593597976E-5,1.3657358721452706E-6,1.3657358721452706E-6,3,9.1954996271541075E-3,9.1954996271541075E-3,5.4629434885810822E-5,"5.4629434886e-05"]
[null,"NN1240","NEPEAN 11KV","Urban",679,5.8901899999999996,4.1885399999999997,3.0293568624379663,0.59971626981870008,1.5275350470582982,5,5.778018754303E-2,5.7780187542849963E-2,1.0079130736432096E-3,1.0079130736432096E-3,4,0.14717169758237436,0.14717169758237436,3.0729057123268588E-4,"0.00030729057123"]
[null,"NN1251","NEPEAN 11KV","Short rural",177,26.9768720174065,2.0444599999999999,1.7909405350262191,0.23580684398839999,0,5,5.8799618252689992E-2,5.879961825315471E-2,6.9279983033473534E-4,6.9279983033473534E-4,0,0,0,0,"0"]
[null,"NN1255","NEPEAN 11KV","Urban",1005,1.0892500000000001,8.8778500000000005,2.6483056847728133,0,0,0,0,0,0,0,0,0,0,0,"0"]
[null,"NN1262","NEPEAN 11KV","Urban",1519,4.1571000000000007,11.178180000000001,4.13440527766691,0.12474302537,1.430575695518963,1,1.2018475674999999E-2,1.2018475674878381E-2,6.8286793607263526E-5,6.8286793607263526E-5,3,0.13783006421690072,0.13783006421690072,2.1442053192680748E-4,"0.00021442053193"]
[null,"NN1273","NEPEAN 11KV","Short rural",143,0,3.17103,0.54617335465338668,0,0,0,0,0,0,0,0,0,0,0,"0"]
[null,"NN1277","NEPEAN 11KV","Urban",1384,9.2156780035522008,6.5643350674502301,4.1534578365501673,1.5862209704028003,0.42866239627916608,10,0.15282584409141006,0.15282584409305577,2.6590877430668412E-3,2.6590877430668412E-3,2,4.1299852773672985E-2,4.1299852773672985E-2,1.1745328500449327E-4,"0.000117453285"]
[null,"NN1281","NEPEAN 11KV","Short rural",50,0.46544000000000002,2.0236300000000003,0,0.10586146744,0,1,2.6397087412999998E-2,2.6397087412958185E-2,6.3624474214414481E-5,6.3624474214414481E-5,0,0,0,0,"0"]
[null,"NN1285","NEPEAN 11KV","Short rural",654,2.95340038806911,8.6641399999999997,2.3053596248741757,0.14847255088,-4.2951291690670412E-2,1,3.7022374607000003E-2,3.7022374606765406E-2,2.8277544095295325E-5,2.8277544095295325E-5,1,-1.0710119826093104E-2,-1.0710119826093104E-2,1.0604079035735746E-5,"1.0604079036e-05"]
[null,"NWA2","NORTH WOLLONGONG","Urban",1677,2.3028152206655701,3.6836340247622004,2.3871586110129552,0,2.5220062908071372,0,0,0,0,0,6,0.24298489769272583,0.24298489769272583,6.5965042624616566E-4,"0.00065965042625"]
[null,"NWB2","NORTH WOLLONGONG","Urban",1754,1.8783210349343,2.1282399999999999,2.7474907659778744,0.28180583459000003,1.262243487985395,1,2.7150829138000002E-2,2.715082913824798E-2,1.4613373831954396E-4,1.4613373831954396E-4,4,0.12161195073517563,0.12161195073517563,3.3187381693130076E-4,"0.00033187381693"]
[null,"NWD2","NORTH WOLLONGONG","Urban",1738,1.8607417506933199,1.5424899999999999,2.4145942958048465,0,1.0621585103570739,0,0,0,0,0,4,0.10233458889984512,0.10233458889984512,5.3809993362523658E-4,"0.00053809993363"]
[null,"NWE2","NORTH WOLLONGONG","Urban",490,3.0075322844521102,0.37367,1.6868881601117887,2.5515618826E-3,0,1,2.4583245699000001E-4,2.4583245698614871E-4,2.7314717442905412E-6,2.7314717442905412E-6,0,0,0,0,"0"]
[null,"NWF2","NORTH WOLLONGONG","Urban",1526,4.3979724869955801,2.6064910306562901,3.753222002260173,0.18318796783300001,0.62938526437814069,2,1.76494046758E-2,1.7649404675733331E-2,2.1578626779895276E-4,2.1578626779895276E-4,5,6.0638672723250013E-2,6.0638672723250013E-2,2.6631849506832778E-4,"0.00026631849507"]
[null,"NWG2","NORTH WOLLONGONG","Urban",34,0,2.0515500000000002,2.0989213388623025,0,0,0,0,0,0,0,0,0,0,0,"0"]
[null,"OA1207","THE OAKS","Short rural",950,35.204043559166799,1.9101600000000001,2.9721991857881931,1.4715011722825,1.1418948191887639,10,0.36692619148266004,0.36692619148310091,5.0775326837986775E-3,5.0775326837986775E-3,7,0.28473719557456434,0.28473719557456434,7.4935491852532604E-4,"0.00074935491853"]
[null,"OA1233","THE OAKS","Short rural",644,59.021649477724999,0.27991000000000005,2.5149377725900095,5.0872510217637004,3.1364082167968164,9,1.2685315361449803,1.2685315361535261,1.0330433180779978E-2,1.0330433180779978E-2,14,0.78207910642960654,0.78207910642960654,1.9900321657064083E-3,"0.0019900321657"]
[null,"OA1244","THE OAKS","Short rural",368,23.936589456728701,0.60816999999999999,1.3717842395945508,1.983712404457,0.44071143850262146,6,0.49464862908899998,0.49464862908620039,4.1892715069413453E-3,4.1892715069413453E-3,5,0.10989360574034145,0.10989360574034145,3.3226114311972005E-4,"0.00033226114312"]
[null,"OP1112","ORAN PARK","Short rural",26,11.8460182378103,0.13040000000000002,0.12066620626063171,0.10169391636649999,5.9536443927661956E-2,6,2.5357887667050001E-2,2.5357887667456083E-2,1.5552649252412428E-4,1.5552649252412428E-4,1,1.4845710650030045E-2,1.4845710650030045E-2,3.5346930119119152E-5,"3.5346930119e-05"]
[null,"OP1122","ORAN PARK","Short rural",339,4.5052899999999996,5.2849500000000003,1.1622060918787167,8.2925761185000002E-2,5.8118909548431907E-2,3,2.0677954119600002E-2,2.0677954119684705E-2,9.5436711321621721E-5,9.5436711321621721E-5,1,1.4492241348838853E-2,1.4492241348838853E-2,3.5346930119119152E-5,"3.5346930119e-05"]
[null,"OP1162","ORAN PARK","Short rural",735,0.14319999999999999,14.802340000000001,2.5911480081230405,1.6529398935449999,0.56427791034010466,3,0.41216884588469999,0.41216884587876096,6.01604750626777E-3,6.01604750626777E-3,9,0.14070552472517761,0.14070552472517761,4.4537131950090134E-4,"0.0004453713195"]
[null,"OP1192","ORAN PARK","Urban",1069,0,14.328700000000001,0,9.0835603022E-2,0,2,8.7516354686999996E-3,8.7516354687068934E-3,3.6874868547922304E-5,3.6874868547922304E-5,0,0,0,0,"0"]
[null,"OP1232","ORAN PARK","Short rural",1494,0,11.92783,5.10608578071305,2.7074906642999999E-3,0.57154986170555477,1,6.7512636528E-4,6.7512636527517584E-4,3.5346930119119156E-6,3.5346930119119156E-6,5,0.14251882224028842,0.14251882224028842,2.9691421300060089E-4,"0.000296914213"]
[null,"OP1282","ORAN PARK","Short rural",897,2.8241100000000001,19.498819999999998,4.8202973974641852,3.5636814294000001E-2,0.50435873213005056,1,8.8862182319000005E-3,8.8862182319465553E-3,2.8277544095295325E-5,2.8277544095295325E-5,3,0.12576437736382595,0.12576437736382595,2.2268565975045067E-4,"0.00022268565975"]
[null,"P608","OAKDALE","Short rural",153,26.610082334622398,0,0.51441908984795648,1.7421497520799998E-2,0.285519774664516,3,4.3441377117000007E-3,4.3441377116397442E-3,2.1208158071471491E-5,2.1208158071471491E-5,2,7.1195786645929807E-2,7.1195786645929807E-2,1.6966526457177193E-4,"0.00016966526457"]
[null,"PCA2","PORT CENTRAL","Short rural",75,4.1843501498329596,2.1901199999999998,1.471812714072837,0.17262733670250002,7.2152499902809364E-2,3,4.3045491498609999E-2,4.304549149906331E-2,5.3020395178678733E-4,5.3020395178678733E-4,3,1.7991587430631648E-2,1.7991587430631648E-2,6.0089781202502562E-5,"6.0089781203e-05"]
[null,"PCB2","PORT CENTRAL","Short rural",1068,7.7809428277494401,1.59375989912161,1.6177197503420102,1.5311214090345,3.2872622254344779,4,0.38179279629768997,0.38179279629564172,2.1596974302781802E-3,2.1596974302781802E-3,8,0.81969530946237323,0.81969530946237323,2.0253790958255275E-3,"0.0020253790958"]
[null,"PCC2","PORT CENTRAL","Urban",62,0.38727482072406699,3.6096999999999997,2.0864838284233116,4.5446152198000002E-2,0.94365263625344198,2,4.3785492061100004E-3,4.3785492060977376E-3,8.8772831689442586E-5,8.8772831689442586E-5,6,9.0917037008710663E-2,9.0917037008710663E-2,2.1715200367109804E-4,"0.00021715200367"]
[null,"PCD2","PORT CENTRAL","Urban",564,3.35601815436176,1.1012899999999999,1.3436779047299692,0.50036128518410006,1.5043583599578869,4,4.8207744815259995E-2,4.8207744814983758E-2,9.4099201590809145E-4,9.4099201590809145E-4,5,0.14493871943141684,0.14493871943141684,4.2337812036503388E-4,"0.00042337812037"]
[null,"PCE2","PORT CENTRAL","Urban",981,4.3149846344013305,0.62970999999999999,3.687942219758467,0.18019697029000001,3.7582521982774533,1,1.7361234406999999E-2,1.7361234406710679E-2,7.6481208840135156E-5,7.6481208840135156E-5,8,0.36209208883838701,0.36209208883838701,8.3309888200861501E-4,"0.00083309888201"]
[null,"PCF2","PORT CENTRAL","Urban",644,2.2846564511430101,1.46607,2.9359612187922379,0.66517800745860001,0.76405103040499511,3,6.4087155800759993E-2,6.4087155800416823E-2,9.2870039305878406E-4,9.2870039305878406E-4,4,7.3613163508630092E-2,7.3613163508630092E-2,2.3217509826469601E-4,"0.00023217509826"]
[null,"PH1201","PENRITH 11KV","Urban",613,0.36364613610894003,4.5858478034904104,2.438727537056979,0.36434886149240003,0,3,3.5103509121570002E-2,3.5103509121749893E-2,8.7133948642868254E-4,8.7133948642868254E-4,0,0,0,0,"0"]
[null,"PH1208","PENRITH 11KV","Urban",2,0,2.0394100000000002,1.1050484152289437,1.3466576603E-3,0,1,1.2974490785000001E-4,1.297449078538007E-4,2.7314717442905412E-6,2.7314717442905412E-6,0,0,0,0,"0"]
[null,"PH1212","PENRITH 11KV","Urban",14,0,1.6016490312484901,2.4958852137067522,0,0,0,0,0,0,0,0,0,0,0,"0"]
[null,"PH1219","PENRITH 11KV","Urban",1148,7.36231943112187,0.82083243788678306,3.2008298923872851,0,1.0319933787670585,0,0,0,0,0,3,9.9428302963919996E-2,9.9428302963919996E-2,2.2944362652040545E-4,"0.00022944362652"]
[null,"PH1223","PENRITH 11KV","Short rural",4,0.17272984971535801,0.6718946122566859,1.3527316807112932,0,1.3608330040608447E-2,0,0,0,0,0,1,3.3933052914354388E-3,3.3933052914354388E-3,7.0693860238238313E-6,"7.0693860238e-06"]
[null,"PH1230","PENRITH 11KV","Urban",204,1.7635500082590199,3.2008803899058096,4.3820885431492593,3.4261805946E-2,0,2,3.3009836029000003E-3,3.300983602975119E-3,4.0972076164358119E-5,4.0972076164358119E-5,0,0,0,0,"0"]
[null,"PH1234","PENRITH 11KV","Urban",12,0,4.29079949516772,3.905774571067818,0,8.0799459616112661E-3,0,0,0,0,0,1,7.7846944712280423E-4,7.7846944712280423E-4,1.3657358721452706E-6,"1.3657358721e-06"]
[null,"PH1238","PENRITH 11KV","Urban",40,0,2.1528899999999997,3.7343015411184997,0.21414691866999999,0,1,2.063217182E-2,2.0632171820498604E-2,5.4629434885810822E-5,5.4629434885810822E-5,0,0,0,0,"0"]
[null,"PH1245","PENRITH 11KV","Urban",5,0,2.6918000000000002,3.6771438644687269,0,0,0,0,0,0,0,0,0,0,0,"0"]
[null,"PH1249","PENRITH 11KV","Urban",427,0,2.6422800000000004,2.1719917126913719,0.22680550067999999,0,1,2.1851773953999998E-2,2.1851773954324329E-2,3.4143396803631763E-5,3.4143396803631763E-5,0,0,0,0,"0"]
[null,"PH1260","PENRITH 11KV","Urban",714,1.9616798558098101,3.9043405662343997,3.0484094213212241,0,0.17627040005725628,0,0,0,0,0,2,1.6982925570126439E-2,1.6982925570126439E-2,3.9606340292212845E-5,"3.9606340292e-05"]
[null,"PH1264","PENRITH 11KV","Urban",278,0.14191478908644398,6.2642605498239101,3.8105117766515302,0,2.679139976744788E-2,0,0,0,0,0,1,2.5812407983545615E-3,2.5812407983545615E-3,9.5601511050168944E-6,"9.560151105e-06"]
[null,"PH1267","PENRITH 11KV","Urban",144,1.8197624604676701,3.8490452544295097,3.6390387467022109,0.44198721944500002,3.9194825585710788E-2,6,4.258364449404E-2,4.2583644493489545E-2,3.0455909948839531E-4,3.0455909948839531E-4,1,3.7762596864816733E-3,3.7762596864816733E-3,9.5601511050168944E-6,"9.560151105e-06"]
[null,"PH1271","PENRITH 11KV","Urban",144,3.4706395767058997,1.3532287694307799,1.6194675050769003,3.9974469494999994E-3,0,2,3.8513751594E-4,3.851375159449663E-4,5.4629434885810824E-6,5.4629434885810824E-6,0,0,0,0,"0"]
[null,"PH1286","PENRITH 11KV","Urban",1460,5.1467792323028094,3.3135300000000001,4.4582987786822894,0.13068249442300001,1.9929115837595224,2,1.25907190057E-2,1.259071900530725E-2,1.0106445453875003E-4,1.0106445453875003E-4,6,0.1920088062649036,0.1920088062649036,4.2337812036503388E-4,"0.00042337812037"]
[null,"PH1290","PENRITH TS","Urban",112,0,3.6650200000000002,1.2193637685284895,0,0,0,0,0,0,0,0,0,0,0,"0"]
[null,"PH1293","PENRITH 11KV","Urban",871,0.99029562299080998,4.4517014119499496,2.8578838324886471,0.33752911104,0.33893247007390415,1,3.2519536852E-2,3.2519536851651036E-2,1.7617992750673992E-4,1.7617992750673992E-4,3,3.265474470299342E-2,3.265474470299342E-2,6.1458114246537178E-5,"6.1458114247e-05"]
[null,"PH1297","PENRITH 11KV","Urban",397,0,3.05799904555793,3.3913554812198616,0,0.20603862202108728,0,0,0,0,0,1,1.9850970901631508E-2,1.9850970901631508E-2,7.7846944712280423E-5,"7.7846944712e-05"]
[null,"PK1221","PORT KEMBLA","Urban",1341,10.484027441426001,1.16115446355526,3.127350523627515,1.288964011037,7.7155971001177663,11,0.12418636285468002,0.12418636285416947,8.0441842869356447E-4,8.0441842869356447E-4,18,0.74336593800105433,0.74336593800105433,1.9256875797248314E-3,"0.0019256875797"]
[null,"PK1225","PORT KEMBLA","Urban",1594,7.60673614439958,0.93288000000000004,2.3657790996047621,0.19999992556749999,3.4761486814668818,2,1.9269167420210002E-2,1.9269167420097624E-2,2.4583245698614871E-4,2.4583245698614871E-4,7,0.33491257924682399,0.33491257924682399,9.000199397437333E-4,"0.00090001993974"]
[null,"PK1236","PORT KEMBLA","Short rural",878,9.0993953803424397,3.2432399999999997,2.603565195832549,1.7166341332900001E-2,3.2027488257447825,2,4.2805132374299998E-3,4.2805132374253299E-3,3.5346930119119159E-5,3.5346930119119159E-5,10,0.7986214697253543,0.7986214697253543,2.1172811141352372E-3,"0.0021172811141"]
[null,"PK1262","PORT KEMBLA","Short rural",1039,7.4751220794610997,0.68861761970417401,1.8704532140990138,0.32247489592600004,4.6854472603880346,4,8.0410731328260002E-2,8.0410731327984167E-2,7.4582022551341405E-4,7.4582022551341405E-4,8,1.1683397546923049,1.1683397546923049,2.7358523912198226E-3,"0.0027358523912"]
[null,"PK1284","PORT KEMBLA","Urban",1,0.28519,0.197810531744435,0.10499738183504061,0,0,0,0,0,0,0,0,0,0,0,"0"]
[null,"PK1288","PORT KEMBLA","Short rural",1983,10.757660178075001,3.3426967895149602,3.511132568065948,5.4546722912831003,2.8430636523589508,3,1.3601498709838,1.360149870983705,1.4043335336326039E-2,1.4043335336326039E-2,10,0.70893216924110136,0.70893216924110136,2.0713301049803826E-3,"0.002071330105"]
[null,"R208","WENTWORTH FALLS","Short rural",1097,10.362211786503,0.39632999999999996,1.467047034010839,0.18317379248400001,1.1741012002848707,3,4.5675303099199996E-2,4.5675303099925776E-2,2.6156728288148173E-4,2.6156728288148173E-4,4,0.2927680180976282,0.2927680180976282,8.0944469972782861E-4,"0.00080944469973"]
[null,"R210","WENTWORTH FALLS","Short rural",1185,16.813465630279399,1.7035550652647902,1.9243084472090226,6.9912795583099999E-2,2.7408027222412952,3,1.7433105934900002E-2,1.7433105934749567E-2,4.1780071400798844E-3,4.1780071400798844E-3,14,0.68343289385316885,0.68343289385316885,1.8097628220989008E-3,"0.0018097628221"]
[null,"R211","WENTWORTH FALLS","Short rural",1345,17.6175323801315,0.7828980825321451,1.6575726228434153,1.887617130095,2.1973200412444953,2,0.4706867908547,0.47068679085221449,1.5199179951221236E-3,1.5199179951221236E-3,6,0.54791276377646603,0.54791276377646603,1.3396486515146161E-3,"0.0013396486515"]
[null,"R245","BLAXLAND","Urban",1612,0,0,3.2579875690370579,0,0.82798183090827016,0,0,0,0,0,2,7.9772632292005249E-2,7.9772632292005249E-2,1.5979109704099666E-4,"0.00015979109704"]
[null,"R246","BLAXLAND","Urban",1101,18.8757947524484,3.3569681780212499,3.7533541000017565,0.83874264333679993,7.562404159754375,8,8.0809392160250001E-2,8.0809392159749791E-2,3.1134779901292567E-3,3.1134779901292567E-3,12,0.72860643043078044,0.72860643043078044,1.7577020674509633E-3,"0.0017577020675"]
[null,"R247","BLAXLAND","Urban",911,5.1204544779435697,0.89651634200997898,3.1246196568542546,0.12683067375859999,1.4813234262953987,3,1.2219611981029999E-2,1.2219611981105979E-2,1.2875580598163561E-3,1.2875580598163561E-3,3,0.14271939863918079,0.14271939863918079,4.4113268670292239E-4,"0.0004411326867"]
[null,"R250","BLAXLAND","Urban",1234,9.3140685122308096,1.03245668908221,4.4201936609157748,3.1018631393613001,2.6736115926657908,10,0.29885171195670002,0.2988517119532671,4.2483566111421733E-3,4.2483566111421733E-3,4,0.25759144284531948,0.25759144284531948,5.6951185868457785E-4,"0.00056951185868"]
[null,"R251","BLAXLAND","Urban",678,1.9752269971411098,1.4448299999999998,1.5051521517773543,0.19434030329489999,0.32305608502652761,4,1.8723886171869999E-2,1.8723886171890698E-2,9.0399960228651488E-4,9.0399960228651488E-4,1,3.1125120526190715E-2,3.1125120526190715E-2,7.2384001223699341E-5,"7.2384001224e-05"]
[null,"R256","BLAXLAND","Urban",1281,0,0,0,1.3451657819844605,1.6352676598797817,7,0.12960117153995701,0.12960117153578721,3.2946521175124563E-3,3.2946521175124563E-3,3,0.1575512902106784,0.1575512902106784,5.5858597170741571E-4,"0.00055858597171"]
[null,"R257","BLAXLAND","Short rural",1365,0,0,0,2.5848447266598003,2.9608749346167595,6,0.64454398610959995,0.64454398610453489,1.4290295346509146E-2,1.4290295346509146E-2,5,0.7383090028631013,0.7383090028631013,1.6648404086105121E-3,"0.0016648404086"]
[null,"R258","BLAXLAND","Urban",1082,0,0,0,1.9907449119580001,2.4966466007627117,3,0.19180005638019998,0.19180005637567415,3.8605492983335606E-3,3.8605492983335606E-3,6,0.24054159621745794,0.24054159621745794,5.7497480217315897E-4,"0.00057497480217"]
[null,"R259","BLAXLAND","Urban",1007,0,0,0,0,0,0,0,0,0,0,0,0,0,0,"0"]
[null,"R260","HARTLEY VALE","Short rural",289,71.734187273881602,0.31985000000000002,0.53347164873121422,4.1013380440776999,1.5027281954217724,19,1.0226891944411602,1.0226891944434626,5.3444558340108158E-3,5.3444558340108158E-3,5,0.37471280619278213,0.37471280619278213,8.2358347177547634E-4,"0.00082358347178"]
[null,"R290","BYLONG","Short rural",39,35.508389509410904,0,0,0.35539004421839998,0.57086944520352434,4,8.8618288501899997E-2,8.8618288501643633E-2,2.8984482697677708E-4,2.8984482697677708E-4,5,0.14234915697571665,0.14234915697571665,3.2165706408398431E-4,"0.00032165706408"]
[null,"R293","BYLONG","Short rural",94,85.295133637570999,0,0,0.62868211578206989,1.3780028892292686,15,0.15676503610158998,0.15676503610206835,6.0051220915093137E-4,6.0051220915093137E-4,18,0.34361192605422219,0.34361192605422219,7.9530592768018099E-4,"0.00079530592768"]
[null,"RBA2","ROBERTSON","Short rural",498,67.643561175142395,1.89175,0.78270515742136526,2.0153176494668004,0.50417445266075067,22,0.50252955531412002,0.50252955531527999,4.6402038014605714E-3,4.6402038014605714E-3,5,0.12571842635467109,0.12571842635467109,4.0295500335795837E-4,"0.00040295500336"]
[null,"RBB2","ROBERTSON","Short rural",355,61.2455580857143,0.94646000000000008,0.93168283109722194,2.7810748739458004,1.4374223865706441,17,0.69347495670063009,0.69347495670001069,2.0713301049803826E-3,2.0713301049803826E-3,12,0.35842847548690399,0.35842847548690399,9.7204057827577673E-4,"0.00097204057828"]
[null,"RBC2","ROBERTSON","Short rural",495,36.717470594733804,0,0.770663305121849,1.6153938278836,0.7746825382492204,7,0.40280654625150997,0.40280654625145806,3.7326358205789826E-3,3.7326358205789826E-3,5,0.19317097310098619,0.19317097310098619,4.1355908239369411E-4,"0.00041355908239"]
[null,"RBD2","ROBERTSON","Short rural",199,39.090965095558701,0,0.75294124993394018,0.85759927690479998,0.1466439315313483,13,0.21384667741138,0.21384667740869251,1.3086845375855111E-3,1.3086845375855111E-3,2,3.6566399208228767E-2,3.6566399208228767E-2,9.5436711321621721E-5,"9.5436711322e-05"]
[null,"RBE2","ROBERTSON","Short rural",404,42.622896281409503,1.5427200000000001,0.80875000541477859,1.5719180484238999,0.95625451688479712,7,0.39196564278898,0.39196564278392421,1.8309709801703723E-3,1.8309709801703723E-3,6,0.23844685589056591,0.23844685589056591,5.8675903997737792E-4,"0.00058675903998"]
[null,"RD1206","RYDALMERE","Urban",188,0.177994025254266,4.8750556195970001,4.1843483853528838,0.20653475904999999,0,1,1.9898771656999999E-2,1.9898771657156592E-2,2.7587864617334467E-4,2.7587864617334467E-4,0,0,0,0,"0"]
[null,"RD1228","RYDALMERE","Urban",902,2.1198890076656598,3.2190637749632001,3.1757618055792931,0.44632487464199999,0,3,4.3001559670000002E-2,4.3001559670365994E-2,2.4856392873043927E-4,2.4856392873043927E-4,0,0,0,0,"0"]
[null,"RD1229","RYDALMERE","Urban",47,0,2.4058200000000003,1.9600256442621757,0,7.2294253340732372E-3,0,0,0,0,0,1,6.9652529479408804E-4,6.9652529479408804E-4,1.3657358721452706E-6,"1.3657358721e-06"]
[null,"RD1232","RYDALMERE","Urban",490,3.36618375804813,1.4925200000000001,2.6734144170397687,0,0,0,0,0,0,0,0,0,0,0,"0"]
[null,"RD1233","RYDALMERE","Urban",76,0,3.4753511920617699,2.3716422070584304,0,6.0953978306892004E-3,0,0,0,0,0,2,5.8726642502246636E-4,5.8726642502246636E-4,4.097207616435812E-6,"4.0972076164e-06"]
[null,"RD1236","RYDALMERE","Short rural",78,0.31700083750513497,6.1843837908019506,3.7489237449761097,9.1941279836999998E-2,1.1340275033840373E-3,1,2.2926018874999999E-2,2.2926018875260683E-2,1.6259587854794812E-4,1.6259587854794812E-4,1,2.8277544095295322E-4,2.8277544095295322E-4,2.8277544095295325E-5,"2.8277544095e-05"]
[null,"RD1251","RYDALMERE","Urban",1069,2.3446062694163601,2.52272768748694,3.9865472593680993,3.1305254491190002,1.3310647820970136,8,0.3016132072139,0.30161320721217805,2.2903390575876184E-3,2.2903390575876184E-3,3,0.12824259839444091,0.12824259839444091,2.9090174076694262E-4,"0.00029090174077"]
[null,"RD1259","RYDALMERE","Urban",123,0,2.47469292612573,3.5838828589057785,0,8.5689953224456314E-2,0,0,0,0,0,3,8.255873347118161E-3,8.255873347118161E-3,4.7800755525084474E-5,"4.7800755525e-05"]
[null,"RD1265","RYDALMERE","Urban",573,2.4139851287121901,3.5472632730667399,3.403213793868801,3.1540139937999999E-2,8.9304665891492933E-3,1,3.0387623154999998E-3,3.0387623155232269E-3,3.4143396803631763E-5,3.4143396803631763E-5,2,8.6041359945152052E-4,8.6041359945152052E-4,2.7314717442905412E-6,"2.7314717443e-06"]
[null,"RD1266","RYDALMERE","Urban",120,0,2.7884080917771499,2.1406540638401901,1.2417601162000001E-2,0,1,1.1963846240000001E-3,1.196384623999257E-3,8.194415232871624E-6,8.194415232871624E-6,0,0,0,0,"0"]
[null,"RD1269","RYDALMERE","Urban",1349,3.4157869161704202,1.7476400000000001,3.2389350101538006,0.60627945399270999,0,2,5.8412523251816999E-2,5.841252325165322E-2,1.8737896165833112E-3,1.8737896165833112E-3,1,0,0,1.3657358721452706E-6,"1.3657358721e-06"]
[null,"RD1273","RYDALMERE","Urban",934,0,3.3126100000000003,1.4947265915564361,0,0,0,0,0,0,0,0,0,0,0,"0"]
[null,"RD1288","RYDALMERE","Urban",42,0,2.8547598226297799,4.0268370705532153,0,2.5515618826140837E-2,0,0,0,0,0,1,2.458324569861487E-3,2.458324569861487E-3,8.194415232871624E-6,"8.1944152329e-06"]
[null,"RD1292","RYDALMERE","Urban",1964,2.2680599999999997,0.89655913670160392,2.639688847475206,0.20289169570099999,3.4020825101521115E-2,3,1.9547777537699998E-2,1.954777753801526E-2,1.3111064372594598E-4,1.3111064372594598E-4,1,3.2777660931486495E-3,3.2777660931486495E-3,5.4629434885810822E-5,"5.4629434886e-05"]
[null,"RD1296","RYDALMERE","Urban",132,2.5290396969477,3.94879185149895,4.4950930803976368,0,0,0,0,0,0,0,0,0,0,0,"0"]
[null,"RD1299","RYDALMERE","Urban",794,3.6762283620692902,1.7341230415056901,3.7547563683355647,0.207881416717,3.1185756343061026E-3,3,2.0028516564699998E-2,2.0028516565010392E-2,3.9606340292212845E-5,3.9606340292212845E-5,1,3.0046189187195955E-4,3.0046189187195955E-4,1.3657358721452706E-6,"1.3657358721e-06"]
[null,"RS1203","ROSEHILL","Urban",274,3.2133909581800597,1.9392638405148901,2.5280662558311722,1.2332549099E-3,0,1,1.1881902088E-4,1.1881902087663854E-4,1.3657358721452706E-6,1.3657358721452706E-6,0,0,0,0,"0"]
[null,"RS1207","ROSEHILL","Urban",1303,2.5082480459735899,2.73750230654244,2.7205021812344312,1.9020759807000001,0,1,0.18325717080000001,0.18325717079619669,1.7740908979167066E-3,1.7740908979167066E-3,0,0,0,0,"0"]
[null,"RS1225","ROSEHILL","Urban",52,0,1.77478,2.5839639232534539,0,0,0,0,0,0,0,0,0,0,0,"0"]
[null,"RS1233","ROSEHILL","Urban",2,0,1.10849,3.5774507150267905,0,0,0,0,0,0,0,0,0,0,0,"0"]
[null,"RS1240","ROSEHILL","Urban",4,0,1.44330289902377,3.3330019389575103,0,0,0,0,0,0,0,0,0,0,0,"0"]
[null,"RS1262","ROSEHILL","Urban",1120,1.5492050900821401,4.6154128940334003,3.8816413298156855,0,0.18470472961367507,0,0,0,0,0,2,1.7795538414052875E-2,1.7795538414052875E-2,1.024301904108953E-4,"0.00010243019041"]
[null,"RS1270","ROSEHILL","Urban",122,2.13831900486622,1.29620741124186,1.5096434749914336,0.14324184902000001,5.2448772031511721E-2,1,1.3800760988E-2,1.3800760988027959E-2,5.8726642502246637E-5,5.8726642502246637E-5,3,5.0532227269375011E-3,5.0532227269375011E-3,2.8680453315050682E-5,"2.8680453315e-05"]
[null,"RS1288","ROSEHILL","Urban",50,0.65911432101729495,1.6163800000000001,2.4466025947287191,0,6.3789047065352092E-3,0,0,0,0,0,1,6.1458114246537175E-4,6.1458114246537175E-4,4.097207616435812E-6,"4.0972076164e-06"]
[null,"RS1292","ROSEHILL","Urban",3,0.689179673709997,0.49852999999999997,2.0074995403168789,0,0,0,0,0,0,0,0,0,0,0,"0"]
[null,"RS1296","ROSEHILL","Urban",11,1.0195937336036001,1.2166635588644101,2.2149742855320014,0,0,0,0,0,0,0,0,0,0,0,"0"]
[null,"RS1299","ROSEHILL","Urban",13,2.9566451432896304,0.52902154660973799,1.7054732962171091,4.4652332945999997E-3,0,1,4.3020679972999998E-4,4.3020679972576026E-4,4.097207616435812E-6,4.097207616435812E-6,0,0,0,0,"0"]
[null,"RV1206","RUSSELL VALE","Short rural",1009,6.35318787823436,1.6568127088262499,1.6770926045046084,0,1.3925148974366361,0,0,0,0,0,3,0.347230568025167,0.347230568025167,9.6143649924004099E-4,"0.00096143649924"]
[null,"RV1220","RUSSELL VALE","Urban",1864,5.0902357051602305,5.6488900000000006,3.8409044185821029,2.4573241971000002,6.116306462782843,1,0.23675304490999999,0.23675304490812696,2.543000193934494E-3,2.543000193934494E-3,12,0.58928088543388057,0.58928088543388057,1.4654345908118754E-3,"0.0014654345908"]
[null,"RV1228","RUSSELL VALE","Urban",1191,5.6329398999028397,0.81423000000000001,2.562899414152124,0.36458984233500003,3.6635467264010937,3,3.5126726631199999E-2,3.5126726631576358E-2,1.8382804839075341E-3,1.8382804839075341E-3,9,0.35296760747658446,0.35296760747658446,8.8636258102228066E-4,"0.00088636258102"]
[null,"RV1246","RUSSELL VALE","Short rural",1592,7.1192769077976701,2.0780091326341199,2.5123872700408314,0.62161717598099997,4.6737526017593867,2,0.15500335796199999,0.15500335795836132,6.2634760171079136E-3,6.2634760171079136E-3,6,1.1654236329574776,1.1654236329574776,2.6722279170054079E-3,"0.002672227917"]
[null,"RV1280","RUSSELL VALE","Short rural",1098,4.74260165485948,2.33586733114356,2.4031322763806786,6.706596129005999,0.96439116422157756,9,1.6723233537090001,1.6723233537167299,9.6532466155314408E-3,9.6532466155314408E-3,3,0.24047576967940335,0.24047576967940335,5.5141210985825881E-4,"0.00055141210986"]
[null,"RV1298","RUSSELL VALE","Short rural",1709,6.2204208142705202,2.8024845265801499,2.3808585648755707,1.9290233093277001,3.8603004982382241,7,0.48101162913890005,0.48101162914000917,2.5343748895408436E-3,2.5343748895408436E-3,7,0.9625852744689124,0.9625852744689124,2.4141953271358384E-3,"0.0024141953271"]
[null,"RW1218","RINGWOOD","Short rural",544,130.050361393532,0.29214999999999997,1.1475025971032111,2.9500795415843197,3.8066184712967823,21,0.73561711749489112,0.73561711750433167,6.29444963344045E-3,6.29444963344045E-3,42,0.9491993920328019,0.9491993920328019,2.5909299777314341E-3,"0.0025909299777"]
[null,"RW1229","RINGWOOD","Short rural",165,33.5829387434922,1.2654000000000001,0.62913073637227412,0.71155084256469991,0.31521711990938545,9,0.17742876840791,0.17742876840851729,1.76532067578701E-3,1.76532067578701E-3,5,7.8600968505885258E-2,7.8600968505885258E-2,2.2975504577427451E-4,"0.00022975504577"]
[null,"RW1255","RINGWOOD","Short rural",234,58.0979019032605,0.75893911609352305,1.0328925642262703,0.79967329571956014,0.81401911727285425,18,0.19940254371239,0.1994025437132439,2.0451886016621332E-3,2.0451886016621332E-3,7,0.20297974620904174,0.20297974620904174,5.2313456576296347E-4,"0.00052313456576"]
[null,"RW1281","RINGWOOD","Short rural",565,140.280312725789,0.24840999999999999,1.1056377743837318,1.77727333398437,0.90754803561445274,34,0.44317201233438996,0.44317201233344938,2.9376719978038411E-3,2.9376719978038411E-3,18,0.22630165070163658,0.22630165070163658,6.5391820720370436E-4,"0.0006539182072"]
[null,"RW1292","RINGWOOD","Short rural",1600,47.2136227941062,4.69618,2.1566378905726444,0.44454474581249998,6.3295745101380039,12,0.11084946012888,0.1108494601287217,6.080058285726964E-3,6.080058285726964E-3,20,1.5783111236789085,1.5783111236789085,3.7856562157576614E-3,"0.0037856562158"]
[null,"S326","WEST CASTLE HILL","Urban",249,0,2.6260400000000002,1.2102693470882149,5.4716827038000002E-2,0,1,5.2717404664999997E-3,5.2717404664807442E-3,3.0046189187195952E-5,3.0046189187195952E-5,0,0,0,0,"0"]
[null,"S327","WEST CASTLE HILL","Urban",670,0.15988999999999998,6.5551854257468802,4.0221425200443806,0,4.6778634514591539E-3,0,0,0,0,0,1,4.5069283780793928E-4,4.5069283780793928E-4,1.3657358721452706E-6,"1.3657358721e-06"]
[null,"S328","WEST CASTLE HILL","Urban",316,0.67160187745077904,1.33400228626475,3.3358744297518155,0.42347422044999999,1.3925857741555978,1,4.0799993444000003E-2,4.0799993444467816E-2,4.3157253559790551E-4,4.3157253559790551E-4,4,0.13416989207955138,0.13416989207955138,3.154849864655575E-4,"0.00031548498647"]
[null,"S330","WEST CASTLE HILL","Urban",173,0,2.40333,2.2598875176727944,0,2.9768221963830978E-2,0,0,0,0,0,1,2.8680453315050682E-3,2.8680453315050682E-3,8.194415232871624E-6,"8.1944152329e-06"]
[null,"S332","WEST CASTLE HILL","Urban",34,0,0.81259999999999999,2.6224043660563141,0,5.8685923300123927E-2,0,0,0,0,0,1,5.6541465106814204E-3,5.6541465106814204E-3,3.1411925059341222E-5,"3.1411925059e-05"]
[null,"S334","WEST CASTLE HILL","Urban",0,0,0,0,0,3.0618742591369007E-2,0,0,0,0,0,1,2.9499894838337843E-3,2.9499894838337843E-3,5.4629434885810824E-6,"5.4629434886e-06"]
[null,"S335","WEST CASTLE HILL","Urban",0,0,0,0,0,8.5052062753802796E-2,0,0,0,0,0,1,8.1944152328716231E-3,8.1944152328716231E-3,1.3657358721452706E-5,"1.3657358721e-05"]
[null,"S336","WEST CASTLE HILL","Urban",231,0.29555026761778802,2.1501600092938,4.0761400122607299,1.5833859015999999E-2,0.53646588581961108,1,1.5255269691999999E-3,1.5255269691862672E-3,3.1685072233770276E-4,3.1685072233770276E-4,5,5.1686274081337767E-2,5.1686274081337767E-2,1.024301904108953E-4,"0.00010243019041"]
[null,"S735","KENTHURST","Short rural",537,17.356210835336501,0.88530094161325501,3.8284872308725935,0.69399648138329995,0.4754410307937576,6,0.17305150048179999,0.17305150047718354,8.3418755081121198E-4,8.3418755081121198E-4,4,0.11855360361952565,0.11855360361952565,3.5700399420310347E-4,"0.0003570039942"]
[null,"S737","KENTHURST","Short rural",473,14.9616201654647,0.31301000000000001,2.9976743622709976,0.34314254717620002,4.1769776785582167,3,8.5564313739069989E-2,8.5564313739351749E-2,1.2866282563359372E-3,1.2866282563359372E-3,9,1.0415503163550246,1.0415503163550246,2.2869463787070091E-3,"0.0022869463787"]
[null,"S738","KENTHURST","Short rural",487,18.503052052161603,0.40222000000000002,3.2135246123711996,4.2496586352604,0.31533052265972383,13,1.0596736771448099,1.0596736771411404,1.3530804849598815E-2,1.3530804849598815E-2,5,7.8629246049980561E-2,7.8629246049980561E-2,2.1561627372662683E-4,"0.00021561627373"]
[null,"S740","KENTHURST","Urban",871,8.7490943863253605,2.7480274865168699,3.8249713986733238,1.5218082081890001,2.6526320838531863,5,0.14661994029482997,0.1466199402900277,1.3384211547023653E-3,1.3384211547023653E-3,12,0.2555701537545445,0.2555701537545445,5.831692174060306E-4,"0.00058316921741"]
[null,"S741","KENTHURST","Short rural",705,26.6934374468667,2.1025694025970001,3.9724940919358085,3.4462528814144995,2.0651349603812932,8,0.85934042628908991,0.85934042628397733,5.0616803930578621E-3,5.0616803930578621E-3,19,0.51495175144038741,0.51495175144038741,1.3537874235622636E-3,"0.0013537874236"]
[null,"S743","KENTHURST","Short rural",281,13.9588780654987,0.61698501898325198,1.7619704841589303,2.11070869068E-2,0.58756800019085431,3,5.2631578947200004E-3,5.263157894736842E-3,5.6555088190590643E-5,5.6555088190590643E-5,6,0.14651302534374888,0.14651302534374888,3.9235092432222263E-4,"0.00039235092432"]
[null,"S744","KENTHURST","Urban",511,6.6002655352537403,2.9540346264936903,2.8578838324886471,0.52580205819100001,0.59675362296826495,2,5.0658858299300003E-2,5.0658858299440328E-2,7.1291412525983119E-4,7.1291412525983119E-4,4,5.7494748745571603E-2,5.7494748745571603E-2,1.3384211547023652E-4,"0.00013384211547"]
[null,"S764","GLENMORE PARK","Short rural",527,9.8437431552377301,4.4466804858665805,3.3341978045700889,0,0,0,0,0,0,0,0,0,0,0,"0"]
[null,"S765","GLENMORE PARK","Urban",1645,7.6980845097199397,17.178524791985097,7.6400761121863168,2.3816420366069999,0.23006582974903655,4,0.2294613810901,0.22946138108674333,2.2411725661903893E-3,2.2411725661903893E-3,4,2.2165893204917742E-2,2.2165893204917742E-2,4.9166491397229741E-5,"4.9166491397e-05"]
[null,"S766","GLENMORE PARK","Urban",832,0,4.70668064337743,4.3439834253827438,0,6.8041650203042236E-3,0,0,0,0,0,1,6.555532186297299E-4,6.555532186297299E-4,1.3657358721452706E-6,"1.3657358721e-06"]
[null,"S768","GLENMORE PARK","Urban",360,0,6.1028400000000005,5.0489281040632772,0.24765743139999999,0,1,2.3860771422E-2,2.3860771422250023E-2,4.9029917810015217E-4,4.9029917810015217E-4,0,0,0,0,"0"]
[null,"S769","GLENMORE PARK","Urban",992,0,6.0192883412730698,4.2868257487329711,0,0,0,0,0,0,0,0,0,0,0,"0"]
[null,"S771","GLENMORE PARK","Urban",582,0,4.0139146820179201,3.2008298923872851,1.9561974432999998E-3,4.6778634514591536E-2,1,1.8847155036000001E-4,1.8847155035604733E-4,1.3657358721452706E-6,1.3657358721452706E-6,1,4.5069283780793928E-3,4.5069283780793928E-3,6.8286793607263528E-6,"6.8286793607e-06"]
[null,"S772","GLENMORE PARK","Urban",1515,0,12.604634182009001,6.8017635213229806,0.180338723723,5.9536443927661956E-2,2,1.73748917655E-2,1.7374891765432131E-2,9.9698718666604749E-5,9.9698718666604749E-5,1,5.7360906630101365E-3,5.7360906630101365E-3,1.9120302210033789E-5,"1.912030221e-05"]
[null,"S774","GLENMORE PARK","Urban",721,0,4.6834600000000002,3.9248271299510757,8.0799459615999998E-4,0,1,7.7846944711999994E-5,7.7846944712280423E-5,1.3657358721452706E-6,1.3657358721452706E-6,0,0,0,0,"0"]
[null,"S775","GLENMORE PARK","Urban",600,0,2.19686,2.5720954492397827,0,0.96931000851750582,0,0,0,0,0,1,9.3389018937293608E-2,9.3389018937293608E-2,3.5918853437420616E-4,"0.00035918853437"]
[null,"S776","GLENMORE PARK","Urban",970,0.40283711935830002,7.9175071113439701,4.7059820441646396,0.28363445393519998,1.1907288785532391E-2,4,2.7327009066169999E-2,2.732700906575472E-2,1.5842536116885141E-4,1.5842536116885141E-4,1,1.1472181326020272E-3,1.1472181326020272E-3,4.097207616435812E-6,"4.0972076164e-06"]
[null,"S785","CRANEBROOK","Urban",1216,4.7024600000000003,2.9901799999999996,4.3820885431492593,1.2789278675989999,9.8235132480642223E-2,3,0.12321942185239999,0.1232194218566906,1.5146010822091052E-3,1.5146010822091052E-3,2,9.4645495939667257E-3,9.4645495939667257E-3,2.5948981570760141E-5,"2.5948981571e-05"]
[null,"S786","CRANEBROOK","Short rural",591,34.494576713237301,2.9600277641197499,3.3151452456868307,1.3459772437580999,0.84910309315879784,10,0.33562617086211999,0.33562617086706015,5.2172068855819865E-3,5.2172068855819865E-3,6,0.21172811141352374,0.21172811141352374,4.983917146795801E-4,"0.00049839171468"]
[null,"S788","CRANEBROOK","Short rural",739,14.416708156979301,8.28538,3.867669453301303,5.3256766627399997E-2,1.599758423680069,2,1.327984164579E-2,1.3279841645753066E-2,4.948570216676682E-5,4.948570216676682E-5,6,0.39890777985931924,0.39890777985931924,8.6599978791841931E-4,"0.00086599978792"]
[null,"S790","CRANEBROOK","Short rural",5,3.7841134411427402,2.0485900000000004,0.95262794416288255,5.0124015649999999E-2,0,1,1.249867449E-2,1.2498674490120532E-2,1.7673465059559576E-5,1.7673465059559576E-5,0,0,0,0,"0"]
[null,"SC1204","SCHOFIELDS","Short rural",1468,6.0770646418190601,12.75263,4.7474404122946083,2.7060731299400002E-2,0.5498615857033351,2,6.7477289597399999E-3,6.7477289597398463E-3,7.0693860238238318E-5,7.0693860238238318E-5,3,0.13711074193206321,0.13711074193206321,2.8631013396486515E-4,"0.00028631013396"]
[null,"SC1208","SCHOFIELDS","Short rural",81,3.6096500000000002,8.0758799999999997,2.5400769889511778,0,2.3814577571064782E-2,0,0,0,0,0,2,5.9382842600120183E-3,5.9382842600120183E-3,1.4138772047647663E-5,"1.4138772048e-05"]
[null,"SC1216","SCHOFIELDS","Urban",1299,0.14141999999999999,11.533393960233399,3.8369618090638662,4.8437149738E-2,8.5052062753802795E-4,1,4.6667194750999999E-3,4.6667194751203898E-3,6.5555321862972992E-5,6.5555321862972992E-5,1,8.1944152328716237E-5,8.1944152328716237E-5,1.3657358721452706E-6,"1.3657358721e-06"]
[null,"SC1238","SCHOFIELDS","Short rural",847,5.9900441863954699,2.9769200000000002,2.6864108025393283,2.2113536315999998E-3,1.7880069892418191,1,5.5141210986000004E-4,5.5141210985825881E-4,3.5346930119119156E-6,3.5346930119119156E-6,2,0.44584850305750945,0.44584850305750945,8.8367325297797881E-4,"0.00088367325298"]
[null,"SC1241","SCHOFIELDS","Short rural",406,3.8721814915711001,7.5861499999999999,0.7366989434859631,0.58272003261999994,8.8099761669147389E-2,2,0.145304160333,0.14530416033367502,2.8984482697677707E-3,2.8984482697677707E-3,1,2.1968117069032553E-2,2.1968117069032553E-2,3.8881623131031071E-5,"3.8881623131e-05"]
[null,"SC1253","SCHOFIELDS","Urban",905,0.46076,8.2675099999999997,2.9483911082076748,0.19766099383999999,0.38783740615734075,1,1.9043821001000001E-2,1.9043821001193652E-2,1.3602729286566896E-3,1.3602729286566896E-3,2,3.7366533461894606E-2,3.7366533461894606E-2,1.0106445453875003E-4,"0.00010106445454"]
[null,"SC1267","SCHOFIELDS","Short rural",368,0.12057,4.0180699999999998,1.1320268386076366,0,0,0,0,0,0,0,0,0,0,0,"0"]
[null,"SC1271","SCHOFIELDS","Urban",957,4.8369733013934404,5.4609499999999995,3.3542461771976506,0,7.9523678674805615E-2,0,0,0,0,0,1,7.6617782427349677E-3,7.6617782427349677E-3,1.5023094593597976E-5,"1.5023094594e-05"]
[null,"SC1279","SCHOFIELDS","Short rural",179,0,6.81229,0.32462511927649712,0,0.25600670888894639,0,0,0,0,0,1,6.3836555795129188E-2,6.3836555795129188E-2,9.8971404333533626E-5,"9.8971404334e-05"]
[null,"SC1289","SCHOFIELDS","Short rural",943,5.8466499999999995,9.1971299999999996,1.1939603566841466,0.19043156850909998,1.5203764984431865,3,4.7485065921900001E-2,4.7485065922024672E-2,2.7924074794104134E-4,2.7924074794104134E-4,8,0.37911349899261249,0.37911349899261249,7.5995899756106178E-4,"0.00075995899756"]
[null,"SG1209","SOUTH GRANVILLE","Urban",1552,4.4201495901122199,1.6113199999999999,3.4938125218704679,0.15237077042290001,0,3,1.4680294889719999E-2,1.4680294889689513E-2,1.2291622849307436E-4,1.2291622849307436E-4,0,0,0,0,"0"]
[null,"SG1220","SOUTH GRANVILLE","Urban",1493,5.0405447929224998,1.6397200000000001,3.610302407223883,1.9479473932089999,1.2443116780881349,5,0.18767669208330001,0.18767669207845883,2.2015662258981763E-3,2.2015662258981763E-3,1,0.11988429485691185,0.11988429485691185,1.912030221003379E-4,"0.0001912030221"]
[null,"SG1221","SOUTH GRANVILLE","Urban",104,0.47169924364814603,1.1050199999999999,1.5567261585037397,8.9928381018000006E-2,0,1,8.6642283729000003E-3,8.6642283728895972E-3,1.434022665752534E-4,1.434022665752534E-4,0,0,0,0,"0"]
[null,"SG1228","SOUTH GRANVILLE","Urban",92,0.40312999999999999,2.4208492045521899,1.6034633556149638,4.3428810433899998E-3,0,2,4.1841866527199997E-4,4.1841866527553859E-4,5.35592863072414E-6,5.35592863072414E-6,0,0,0,0,"0"]
[null,"SG1247","SOUTH GRANVILLE","Urban",1056,3.1916457764857302,0.43464999999999998,2.4974735620323258,0.55909722587700006,0,7,5.38667102941E-2,5.386671029427742E-2,7.2086433918722875E-4,7.2086433918722875E-4,0,0,0,0,"0"]
[null,"SG1250","SOUTH GRANVILLE","Urban",1350,6.0444054718106699,1.50253876383708,3.9064045756815644,2.0152841858971402,0.20837755374681685,7,0.19416431414704902,0.19416431414458415,2.0543255673756513E-3,2.0543255673756513E-3,1,2.0076317320535476E-2,2.0076317320535476E-2,3.8240604420067578E-5,"3.824060442e-05"]
[null,"SG1254","SOUTH GRANVILLE","Urban",173,0,0.78673999999999999,2.5368558363293094,6.4812930631E-3,0,1,6.2444583805E-4,6.2444583805463898E-4,7.590040573527122E-6,7.590040573527122E-6,0,0,0,0,"0"]
[null,"SG1257","SOUTH GRANVILLE","Urban",204,0.26041000000000003,1.5753900000000001,1.4100855987175636,0.47587485405390001,0,2,4.5848578232010002E-2,4.5848578232325875E-2,1.8233964614858112E-4,1.8233964614858112E-4,0,0,0,0,"0"]
[null,"SHA2","SHELLHARBOUR","Urban",1626,0,9.4997418721613105,4.3875045505544801,6.5234932132000004E-2,0.27748235473428162,1,6.2851164835999998E-3,6.2851164836125349E-3,5.3263699013665555E-5,5.3263699013665555E-5,3,2.6734279697243672E-2,2.6734279697243672E-2,1.2428196436521964E-4,"0.00012428196437"]
[null,"SHB2","SHELLHARBOUR","Urban",1035,5.2308480472396202,4.6477037396713907,3.4301109263295855,1.1934221938701999,1.1349489007305367,3,0.11498130307873,0.11498130307591034,1.4149023635425004E-3,1.4149023635425004E-3,7,0.10934764260331109,0.10934764260331109,4.6161872478510147E-4,"0.00046161872479"]
[null,"SHC2","SHELLHARBOUR","Urban",1359,1.82416078650064,9.2126322988373506,2.8604140123083437,0,0.5395135847349557,0,0,0,0,0,5,5.1979907293848999E-2,5.1979907293848999E-2,4.7527608350655416E-4,"0.00047527608351"]
[null,"SHD2","SHELLHARBOUR","Urban",1217,5.1877819778006797,2.9827300000000001,2.7735229122653595,2.9819678462037,6.1831432087635401,6,0.28730029527388995,0.28730029527209555,3.3651731889659466E-3,3.3651731889659466E-3,10,0.59572033007104563,0.59572033007104563,1.5405500637798652E-3,"0.0015405500638"]
[null,"SHE2","SHELLHARBOUR","Urban",1594,7.7475360129650195,2.81379,3.3923716176936289,0.194613294927,1.3191574933114814,2,1.8750187788500003E-2,1.8750187788682419E-2,1.912030221003379E-4,1.912030221003379E-4,4,0.12709538026183889,0.12709538026183889,4.0289208228285481E-4,"0.00040289208228"]
[null,"SHF2","SHELLHARBOUR","Urban",204,0,3.2023598469118499,3.1997934331840363,0,4.5219346697438483E-2,0,0,0,0,0,1,4.3566974321434136E-3,4.3566974321434136E-3,3.0046189187195952E-5,"3.0046189187e-05"]
[null,"SHG2","SHELLHARBOUR","Short rural",665,0,4.9178000000000006,1.1877365207822819,0,0,0,0,0,0,0,0,0,0,0,"0"]
[null,"SHH2","SHELLHARBOUR","Short rural",393,6.1769167383670105,12.153739999999999,3.9720165077931275,1.1155733189548001,0.18252172666966079,4,0.27817379758488003,0.27817379758605448,1.7088798373223995E-3,1.7088798373223995E-3,7,4.5512707221377825E-2,4.5512707221377825E-2,1.0957548336926938E-4,"0.00010957548337"]
[null,"SHJ2","SHELLHARBOUR","Short rural",1511,16.610545638691299,14.419440234129899,2.7299573311229026,0.50629488053867,1.9919051343502692,8,0.12624716567315999,0.12624716567247707,9.2520025025226405E-4,9.2520025025226405E-4,18,0.49669152734085042,0.49669152734085042,2.633346293874377E-3,"0.0026333462939"]
[null,"SHK2","SHELLHARBOUR","Short rural",1468,5.71805694376304,4.3404600000000002,2.9347723391179223,0.61403336705400002,6.6080491389377469,2,0.15311229719700001,0.15311229719698843,5.1959987275105159E-4,5.1959987275105159E-4,16,1.6477501678979181,1.6477501678979181,3.8245378388886927E-3,"0.0038245378389"]
[null,"SHL2","SHELLHARBOUR","Urban",1,0,3.0770399999999998,1.8876849834383296,0,0,0,0,0,0,0,0,0,0,0,"0"]
[null,"SL1112","SOUTH LEPPINGTON","Short rural",640,17.258415228321798,19.073970546693399,2.1629176139805657,1.7517625252195999,8.9843328955600349E-2,5,0.43681076432252997,0.43681076431823568,3.2327033422771905E-3,3.2327033422771905E-3,6,2.240288430949772E-2,2.240288430949772E-2,8.129793927397406E-5,"8.1297939274e-05"]
[null,"SL1122","SOUTH LEPPINGTON","Short rural",257,6.8562497366235604,15.20496,1.7972913879873043,8.0019815707800007E-2,0,2,1.9953342052620001E-2,1.9953342052242761E-2,6.3624474214414481E-5,6.3624474214414481E-5,0,0,0,0,"0"]
[null,"SL1132","SOUTH LEPPINGTON","Short rural",1643,4.5624399999999996,12.132620000000001,1.9560627120144585,1.9774604590500001E-2,0.2742220256620525,2,4.9308967515999998E-3,4.9308967516171216E-3,2.1208158071471491E-5,2.1208158071471491E-5,5,6.8378636315436003E-2,6.8378636315436003E-2,1.6259587854794812E-4,"0.00016259587855"]
[null,"SL1142","SOUTH LEPPINGTON","Short rural",162,6.2920653884188793,1.46841,0.57718583983296057,0,0,0,0,0,0,0,0,0,0,0,"0"]
[null,"SN1208","SOUTH NOWRA","Short rural",348,9.5463559669309195,2.3166466070443499,3.5148262241481025,0.95429831943940002,0.3739030432095094,7,0.2379590682563,0.23795906825492208,2.7111095401364397E-3,2.7111095401364397E-3,5,9.3234597575200598E-2,9.3234597575200598E-2,2.4389381782192215E-4,"0.00024389381782"]
[null,"SN1219","SOUTH NOWRA","Short rural",60,8.6505305702098099,0.49892000000000003,1.1808623575372026,0,4.8479675769667593E-2,0,0,0,0,0,2,1.208865010073875E-2,1.208865010073875E-2,4.2416316142942983E-5,"4.2416316143e-05"]
[null,"SN1230","SOUTH NOWRA","Short rural",375,46.832124856827406,0.10837999999999999,0.881020806856047,0.26370392057050002,2.5938044071151394,9,6.5755894099650006E-2,6.5755894100597359E-2,7.8823654165635724E-4,7.8823654165635724E-4,13,0.64677812731964224,0.64677812731964224,1.5870771623484501E-3,"0.0015870771623"]
[null,"SN1252","SOUTH NOWRA","Short rural",72,5.66871407864517,3.6670400000000001,2.6929547214304375,0.10362176312,0,1,2.5838605917000001E-2,2.5838605917076103E-2,2.5449789685765792E-4,2.5449789685765792E-4,0,0,0,0,"0"]
[null,"SN1271","SOUTH NOWRA","Urban",1032,7.8038400000000001,6.6057899999999998,3.3353765228796721,0.23005165441,0.83988911969380253,1,2.2164527468999998E-2,2.2164527469045597E-2,1.4162680994146456E-3,1.4162680994146456E-3,5,8.0919850424607281E-2,8.0919850424607281E-2,2.868045331505068E-4,"0.00028680453315"]
[null,"SN1282","SOUTH NOWRA","Short rural",41,7.3314282016934804,5.6982100000000004,0.58400411557198295,0.10530862903,0.12417601162055208,1,2.6259234385E-2,2.6259234385493619E-2,2.3682443179809834E-4,2.3682443179809834E-4,3,3.0963910784348379E-2,3.0963910784348379E-2,8.8367325297797884E-5,"8.8367325298e-05"]
[null,"SQ1112","SOUTH MARSDEN PARK","Short rural",9,0,2.6726399999999999,0,0,0,0,0,0,0,0,0,0,0,0,"0"]
[null,"SQ1122","SOUTH MARSDEN PARK","Short rural",25,0,6.1619200000000003,0,0,0,0,0,0,0,0,0,0,0,0,"0"]
[null,"SQ1132","SOUTH MARSDEN PARK","Short rural",60,3.2250300000000003,4.3936874529881198,0,5.0605977338999998E-3,9.3557269029183071E-2,1,1.2618854053000001E-3,1.2618854052525539E-3,1.0604079035735746E-5,1.0604079035735746E-5,2,2.3328973878618642E-2,2.3328973878618642E-2,4.9485702166766813E-5,"4.9485702167e-05"]
[null,"SQ1142","SOUTH MARSDEN PARK","Short rural",285,0.42472000000000004,9.0564400000000003,0,0.79828448566999999,1.7860933178298587E-2,2,0.19905623696300001,0.19905623696581953,1.8698526033014032E-3,1.8698526033014032E-3,1,4.453713195009013E-3,4.453713195009013E-3,1.0604079035735746E-5,"1.0604079036e-05"]
[null,"SWC2","SOUTH WOLLONGONG","Urban",1770,7.1598625778278304,1.19278,2.8823244550240901,0.18371245554999999,0.39620085899479801,1,1.7699936903000001E-2,1.7699936903002707E-2,7.3749737095844608E-5,7.3749737095844608E-5,2,3.8172317626460311E-2,3.8172317626460311E-2,9.9698718666604749E-5,"9.9698718667e-05"]
[null,"SWD2","SOUTH WOLLONGONG","Urban",258,2.28691777277511,2.4413581093585801,2.1129287801532732,5.991917821E-2,0.36132951326573887,1,5.7729655315999998E-3,5.7729655315580585E-3,3.5509132675777037E-5,3.5509132675777037E-5,3,3.4812607380982949E-2,3.4812607380982949E-2,1.2428196436521964E-4,"0.00012428196437"]
[null,"SWE2","SOUTH WOLLONGONG","Urban",1452,2.1457565723266998,2.6237300000000001,3.6021339401453414,1.488396922842,1.9931242139164069,2,0.14340090084329998,0.14340090083938128,2.0513352799621963E-3,2.0513352799621963E-3,7,0.19202929230298577,0.19202929230298577,5.8726642502246636E-4,"0.00058726642502"]
[null,"SWF2","SOUTH WOLLONGONG","Short rural",52,0.75934999999999997,5.8770000000000003E-2,0.11718085815558785,0,0,0,0,0,0,0,0,0,0,0,"0"]
[null,"SWG2","SOUTH WOLLONGONG","Urban",234,0.83779100354747904,0.69972999999999996,0.44698636819244286,0,0.14706919184511733,0,0,0,0,0,1,1.4169509673507183E-2,1.4169509673507183E-2,3.4143396803631763E-5,"3.4143396804e-05"]
[null,"SWH2","SOUTH WOLLONGONG","Urban",1053,3.8281154614140602,1.18655,3.2006196791542791,2.1319717064000002E-2,2.0465369093257952,1,2.0540667517000002E-3,2.0540667517064868E-3,4.3703547908648659E-5,4.3703547908648659E-5,6,0.19717538506922916,0.19717538506922916,6.1048393484893599E-4,"0.00061048393485"]
[null,"SWJ2","SOUTH WOLLONGONG","Urban",855,2.3425867439854602,2.5172300000000001,3.3452127239457901,1.4491737465699999,0.15408598702230605,2,0.13962190968099999,0.13962190968115529,1.8218916534417909E-3,1.8218916534417909E-3,3,1.4845548930219091E-2,1.4845548930219091E-2,5.5995170757956096E-5,"5.5995170758e-05"]
[null,"SXA2","SUSSEX INLET","Urban",1307,6.7418340768024798,1.9304482051417799,1.9936159406586491,0,2.7229417890629963,0,0,0,0,0,6,0.26234420368038502,0.26234420368038502,7.7164076776207785E-4,"0.00077164076776"]
[null,"SXB2","SUSSEX INLET","Short rural",992,10.439417989933599,0.34761999999999998,1.4870954066383957,3.0338212538549003,2.408107403436003,5,0.75649853310319004,0.75649853310240012,7.3592308508006084E-3,7.3592308508006084E-3,5,0.60047364886359622,0.60047364886359622,1.5658690042769786E-3,"0.0015658690043"]
[null,"SXC2","SUSSEX INLET","Short rural",465,44.0814816658472,0.60170000000000001,0.89776673594383749,1.3310222560678002,3.9379246808448616,6,0.33189706973946997,0.33189706973949318,3.096391078434838E-3,3.096391078434838E-3,16,0.981941253402142,0.981941253402142,2.5379095825527553E-3,"0.0025379095826"]
[null,"SXD2","SUSSEX INLET","Short rural",780,16.235347999049999,0.19981700322131998,1.3282732757875597,0.48839729502000001,3.4509165695165867,3,0.12178431302959,0.12178431303241313,1.0462691315259269E-3,1.0462691315259269E-3,6,0.86050334028489628,0.86050334028489628,2.1738362023258281E-3,"0.0021738362023"]
[null,"SY1112","ST MARYS","Urban",1215,5.5876792363732299,0.48226762766341102,4.0010373654841063,1.0844563261573001,0.11623781909686381,3,0.10448289142496001,0.10448289142672963,1.6498089335514868E-3,1.6498089335514868E-3,1,1.1199034151591219E-2,1.1199034151591219E-2,5.5995170757956096E-5,"5.5995170758e-05"]
[null,"SY1122","ST MARYS","Urban",529,2.6494596656740499,1.2999993675064199,1.9814661238587954,0,0,0,0,0,0,0,0,0,0,0,"0"]
[null,"SY1132","ST MARYS","Urban",1871,6.2764602963813907,0.79901999999999995,4.3058783076162293,1.3151458709939998,4.2515399869057173,4,0.12670887700921002,0.12670887701002176,2.6522590637061156E-3,2.6522590637061156E-3,2,0.40961833145317028,0.40961833145317028,8.3992756136934139E-4,"0.00083992756137"]
[null,"SY1152","ST MARYS","Urban",731,2.5722768500819502,6.3781953661077795,3.6009336289356959,0,9.6959351539335187E-2,0,0,0,0,0,1,9.3416333654736516E-3,9.3416333654736516E-3,4.9166491397229741E-5,"4.9166491397e-05"]
[null,"SY1222","ST MARYS","Urban",456,1.70330901343907,8.8410000000000002E-2,1.3717842395945508,1.1482028472E-2,0,1,1.1062460564000001E-3,1.1062460564376692E-3,2.458324569861487E-5,2.458324569861487E-5,0,0,0,0,"0"]
[null,"SY1232","ST MARYS","Urban",1140,3.4434145198217703,4.2974542863476399,4.0200899243673645,0,0,0,0,0,0,0,0,0,0,0,"0"]
[null,"SY1242","ST MARYS","Urban",312,1.2845355492341,1.77607656464399,0.97168050304614018,4.0541483246000001E-3,0,1,3.9060045943000002E-4,3.9060045943354737E-4,1.3657358721452706E-6,1.3657358721452706E-6,0,0,0,0,"0"]
[null,"SY1252","ST MARYS","Urban",180,1.3654200000000001,1.90401,1.5432572695438695,0.25592165683000001,4.4652332945746467E-3,1,2.4656995436000001E-2,2.4656995435710715E-2,2.4583245698614871E-4,2.4583245698614871E-4,1,4.3020679972576026E-4,4.3020679972576026E-4,1.3657358721452706E-6,"1.3657358721e-06"]
[null,"SY1322","ST MARYS","Urban",1142,5.3545293815893302,0.36943999999999999,2.9531466269049358,5.0180717024900005E-2,0,3,4.8347049874500007E-3,4.8347049873942571E-3,6.6921057735118246E-5,6.6921057735118246E-5,0,0,0,0,"0"]
[null,"SY1332","ST MARYS","Short rural",848,7.88280825072456,5.2504889337462304,3.0674619802044814,2.8867378866038997,0.34233455258405626,5,0.71982255841366993,0.719822558410802,6.2175250079530599E-3,6.2175250079530599E-3,2,8.5362836237672754E-2,8.5362836237672754E-2,2.1208158071471493E-4,"0.00021208158071"]
[null,"SY1342","ST MARYS","Urban",2,0,4.07273,3.0484094213212241,0,0,0,0,0,0,0,0,0,0,0,"0"]
[null,"SY1352","ST MARYS","Urban",1389,7.1515482988480494,0.66176999999999997,3.6771438644687269,0,1.1291370097756936,0,0,0,0,0,1,0.10878769089573152,0.10878769089573152,2.4446672111400346E-4,"0.00024446672111"]
[null,"SZ1112","SOUTH WINDSOR","Urban",1010,1.2374799999999999,7.0156499999999999,3.3341978045700889,1.5988795523999999,0.20412495060912669,1,0.15404544622999999,0.15404544622688152,1.3807589667388686E-3,1.3807589667388686E-3,1,1.9666596558891896E-2,1.9666596558891896E-2,8.1944152328716237E-5,"8.1944152329e-05"]
[null,"SZ1122","SOUTH WINDSOR","Short rural",819,18.767017382743802,3.7923080252039498,4.8202973974641852,1.4531492468995,1.795023784419008,4,0.36235004691463002,0.36235004692209044,3.2880946279738787E-3,3.2880946279738787E-3,3,0.44759817609840585,0.44759817609840585,9.7557527128768861E-4,"0.00097557527129"]
[null,"SZ1132","SOUTH WINDSOR","Urban",224,6.3269556417243304,1.4537599999999999,4.0772476010171372,6.0386964555000002E-3,7.1939869745924867E-2,1,5.8180348153E-4,5.8180348153388523E-4,8.194415232871624E-6,8.194415232871624E-6,2,6.9311095511372482E-3,6.9311095511372482E-3,1.7754566337888518E-5,"1.7754566338e-05"]
[null,"SZ1142","SOUTH WINDSOR","Urban",232,0.90782000000000007,1.29277,2.6102005670062978,5.7410142359000001E-3,0.18477560633263657,1,5.5312302822E-4,5.5312302821883459E-4,1.2291622849307435E-5,1.2291622849307435E-5,2,1.7802367093413603E-2,1.7802367093413603E-2,8.057841645657097E-5,"8.0578416457e-05"]
[null,"SZ1152","SOUTH WINDSOR","Urban",1050,6.3503400000000001,0.74327999999999994,5.029875545180019,2.7230693671569002,7.8673158047267586E-2,3,0.26235649530373001,0.26235649530323435,2.8735082749936493E-3,2.8735082749936493E-3,1,7.5798340904062516E-3,7.5798340904062516E-3,1.3657358721452706E-5,"1.3657358721e-05"]
[null,"SZ1162","SOUTH WINDSOR","Urban",1,0,0.39023000000000002,0.49536653096469885,0,0,0,0,0,0,0,0,0,0,0,"0"]
[null,"SZ1212","SOUTH WINDSOR","Urban",279,0,1.74363,1.0097856208126554,0,0.45417801510530692,0,0,0,0,0,1,4.3758177343534467E-2,4.3758177343534467E-2,1.2155049262092909E-4,"0.00012155049262"]
[null,"SZ1242","SOUTH WINDSOR","Short rural",753,23.865377828974097,6.0447344457232806,4.5726141319818359,0.36035141454159997,1.4205112014264296,4,8.9855431055630014E-2,8.9855431055812798E-2,3.0857869993991022E-3,3.0857869993991022E-3,7,0.35421158672369307,0.35421158672369307,1.0462691315259269E-3,"0.0010462691315"]
[null,"SZ1322","SOUTH WINDSOR","Short rural",1135,24.976039638826698,1.0190468534849801,4.7250346030478969,0.41466508154099996,0.1793180989726009,7,0.1033988161059,0.10339881610520241,5.3716833055602702E-3,5.3716833055602702E-3,3,4.4713866600685728E-2,4.4713866600685728E-2,1.0250609734544554E-4,"0.00010250609735"]
[null,"SZ1332","SOUTH WINDSOR","Short rural",628,19.84159,4.0389600000000003,3.8867220121845607,1.8706350681939998,0.78829086828982886,4,0.46645222862546998,0.46645222862394398,3.5912481001025062E-3,3.5912481001025062E-3,6,0.19656427839242163,0.19656427839242163,5.2313456576296347E-4,"0.00052313456576"]
[null,"SZ1342","SOUTH WINDSOR","Urban",454,5.0722500000000004,2.5074800000000002,3.3723029223366039,2.0871067432477997,2.4806851636525813E-3,4,0.20108412113763,0.20108412113530888,1.3233980601087673E-3,1.3233980601087673E-3,1,2.3900377762542236E-4,2.3900377762542236E-4,1.3657358721452706E-6,"1.3657358721e-06"]
[null,"SZ1352","SOUTH WINDSOR","Urban",1424,1.4843199999999999,7.2094104645748702,5.10608578071305,5.2644060137310014,0.64852197849774629,5,0.50720379299319995,0.50720379299231999,3.5367167639308887E-3,3.5367167639308887E-3,1,6.2482416150646126E-2,6.2482416150646126E-2,2.0486038082179059E-4,"0.00020486038082"]
[null,"T828","BLACKMANS FLAT","Short rural",266,93.780130228059392,6.9894999999999996,0.89547026751310954,0.70654163329652997,0.13000207791918758,10,0.17617969697364996,0.17617969697328884,2.5979993637520234E-3,2.5979993637520234E-3,8,3.2416669612244174E-2,3.2416669612244174E-2,2.5449789685765792E-4,"0.00025449789686"]
[null,"T829","BLACKMANS FLAT","Urban",13,5.1507804134682704,4.6200000000000005E-2,1.9814661238587954,2.3603278346500001E-2,4.5361100135361491E-3,2,2.274078457E-3,2.2740784569628479E-3,2.4583245697843227E-5,2.4583245697843227E-5,1,4.3703547908648658E-4,4.3703547908648658E-4,2.7314717442905412E-6,"2.7314717443e-06"]
[null,"T831","BLACKMANS FLAT","Short rural",1102,69.3288599354008,3.5508553118026698,1.467047034010839,2.0320511391697402,0.76155616989755026,21,0.50670213483303994,0.50670213482952531,5.5141210985814584E-3,5.5141210985814584E-3,14,0.18989784737195575,0.18989784737195575,5.6555088190590643E-4,"0.00056555088191"]
[null,"T834","BLACKMANS FLAT","Short rural",132,30.1124758198781,0.221433261246512,0.62873444314750238,5.4397868128000001E-2,9.5924551442497244E-2,1,1.3564381023E-2,1.3564381023414304E-2,4.7011417057991938E-4,4.7011417057991938E-4,5,2.3919267611607932E-2,2.3919267611607932E-2,6.7159167226326399E-5,"6.7159167226e-05"]
[null,"T836","BLACKMANS FLAT","Short rural",32,12.0311373418944,0.78675714705980004,1.1241009741122014,1.3088208872999999E-2,5.5850854541663837E-2,1,3.2636104717999998E-3,3.2636104718215863E-3,1.1311017638091619E-4,1.1311017638091619E-4,2,1.3926690466932947E-2,1.3926690466932947E-2,4.5951009154854901E-5,"4.5951009155e-05"]
[null,"T838","PORTLAND","Short rural",646,23.536148375544499,0.40206999999999998,1.143153532995459,2.6017851256642999,0.12474302537224409,4,0.64876815948319999,0.64876815948534872,4.6127743805450504E-3,4.6127743805450504E-3,3,3.1105298504824856E-2,3.1105298504824856E-2,8.4832632285885965E-5,"8.4832632286e-05"]
[null,"T841","PORTLAND","Short rural",398,21.300554219146498,0.54958000000000007,0.70494467868053301,6.5773595196399998E-2,0.34233455258405626,5,1.640097557534E-2,1.6400975575271291E-2,1.131101763811813E-4,1.131101763811813E-4,4,8.5362836237672754E-2,8.5362836237672754E-2,1.7319995758368386E-4,"0.00017319995758"]
[null,"T842","PORTLAND","Short rural",235,42.504752639376903,0.16930000000000001,0.53347164873121422,0.23458776441846002,0.39954624012978091,8,5.8495634653799998E-2,5.8495634654130289E-2,4.2062846841751797E-4,4.2062846841751797E-4,9,9.9628857233749243E-2,9.9628857233749243E-2,3.1812237107207238E-4,"0.00031812237107"]
[null,"T865","AMBARVALE","Urban",836,0,6.3041198221174399,3.2198824512705428,0,0,0,0,0,0,0,0,0,0,0,"0"]
[null,"T866","AMBARVALE","Urban",753,0,7.6626151224362706,3.2198824512705428,1.1014242127E-2,0.18385420898613702,1,1.0611767727E-3,1.0611767726568752E-3,2.8680453315050682E-5,2.8680453315050682E-5,2,1.7713594261724159E-2,1.7713594261724159E-2,4.2337812036503386E-5,"4.2337812037e-05"]
[null,"T868","AMBARVALE","Short rural",981,39.6177887555301,3.9788937807181202,3.6580913055854687,3.2338353547037002,1.2202135936412242,8,0.80637305150437988,0.80637305150047711,4.7152804778904951E-3,4.7152804778904951E-3,7,0.30426637446537769,0.30426637446537769,7.8470184864444525E-4,"0.00078470184864"]
[null,"T869","AMBARVALE","Urban",1535,0,9.7684670577214998,3.2960926868035734,0.30601732178423002,0.55113736664464208,9,2.9483506007434993E-2,2.9483506007872105E-2,2.3627230588113183E-4,2.3627230588113183E-4,1,5.309981070900812E-2,5.309981070900812E-2,2.2124921128753382E-4,"0.00022124921129"]
[null,"T870","AMBARVALE","Urban",837,0,7.4554812724819399,2.7054633614225865,0,0,0,0,0,0,0,0,0,0,0,"0"]
[null,"T872","AMBARVALE","Urban",861,0,7.72403705922481,2.5149377725900095,8.7008260197400003E-2,0,2,8.3828867832200001E-3,8.3828867832276711E-3,2.0486038082179059E-5,2.0486038082179059E-5,0,0,0,0,"0"]
[null,"T874","AMBARVALE","Short rural",457,12.449259139006601,3.3410367911851901,1.7909405350262191,0.29972346914920001,1.8924083962721123E-2,2,7.4737549044229995E-2,7.4737549043865537E-2,1.5941465483722739E-3,1.5941465483722739E-3,1,4.7188151709024071E-3,4.7188151709024071E-3,1.0604079035735746E-5,"1.0604079036e-05"]
[null,"T876","AMBARVALE","Urban",903,0,7.5680580967096001,3.6580913055854687,9.9369159984000009E-3,3.0618742591369007E-2,1,9.5738084636999999E-4,9.573808463738347E-4,1.0925886977162165E-5,1.0925886977162165E-5,1,2.9499894838337843E-3,2.9499894838337843E-3,1.2291622849307435E-5,"1.2291622849e-05"]
[null,"T882","ROOTY HILL","Urban",719,1.5423699999999998,3.7786144853482901,3.2071807453483645,4.6069867325300003E-2,0,2,4.4386415845099995E-3,4.4386415844721297E-3,9.7513541271172322E-4,9.7513541271172322E-4,0,0,0,0,"0"]
[null,"T883","ROOTY HILL","Urban",1308,0.97723329343126208,8.2326106330754794,4.5660194062670501,1.7386983870649999,1.5634695435717798,4,0.16751641391090002,0.16751641391128455,2.217802871557682E-3,2.217802871557682E-3,5,0.15063383801826263,0.15063383801826263,3.8923472356140211E-4,"0.00038923472356"]
[null,"T884","ROOTY HILL","Urban",334,0.89693000000000001,6.6253867723797404,2.9277432150605986,1.1269398315E-2,0,1,1.0857600183999999E-3,1.0857600183554902E-3,2.7314717442905412E-6,2.7314717442905412E-6,0,0,0,0,"0"]
[null,"T887","ROOTY HILL","Urban",86,0.86882000000000004,3.01566,2.7118142143836659,0,0,0,0,0,0,0,0,0,0,0,"0"]
[null,"T888","ROOTY HILL","Urban",675,2.6354115311392201,4.5075108543607101,6.9478331394279635,0,0.17690829052790982,0,0,0,0,0,1,1.7044383684372978E-2,1.7044383684372978E-2,3.5509132675777037E-5,"3.5509132676e-05"]
[null,"T889","ROOTY HILL","Urban",1206,4.3572822994493201,3.6130432581381902,3.4358114519474561,6.9459184582000002E-4,0.39294052992256889,1,6.6921057735E-5,6.6921057735118259E-5,1.3657358721452706E-6,1.3657358721452706E-6,3,3.7858198375866903E-2,3.7858198375866903E-2,8.6041359945152052E-5,"8.6041359945e-05"]
[null,"T890","ROOTY HILL","Urban",1102,1.9216540693942901,6.9517457083085299,3.9311779829121556,4.0366485314260991,0.62981052469190968,6,0.38891442658847003,0.38891442658964626,4.340460786479732E-3,4.340460786479732E-3,2,6.0679644799414373E-2,6.0679644799414373E-2,1.3793932308667233E-4,"0.00013793932309"]
[null,"T892","ROOTY HILL","Urban",56,0.85877000000000003,2.8557734733378002,2.8705855384108254,0,0,0,0,0,0,0,0,0,0,0,"0"]
[null,"T893","ROOTY HILL","Urban",885,3.8860656279600296,1.58836,2.5911480081230405,0.62133366910700005,1.1996593451423885,3,5.9862934747600002E-2,5.98629347478715E-2,4.4659563019150346E-4,4.4659563019150346E-4,5,0.11558222685965425,0.11558222685965425,1.9530022971677368E-4,"0.00019530022972"]
[null,"T894","ROOTY HILL","Urban",1406,3.24693092831953,6.7520299352072595,4.058195042133879,3.3089079754040003,0.13565804009231547,4,0.31879962742430001,0.3187996274272541,2.0363121853685987E-3,2.0363121853685987E-3,3,1.307009229643024E-2,1.307009229643024E-2,2.458324569861487E-5,"2.4583245699e-05"]
[null,"T895","ROOTY HILL","Urban",333,1.0995367758126999,3.9446940949590901,2.6102005670062978,0.1216811511131,3.6147126670366186E-3,3,1.172347672646E-2,1.1723476726495003E-2,7.9212680584425703E-5,7.9212680584425703E-5,1,3.4826264739704402E-4,3.4826264739704402E-4,1.3657358721452706E-6,"1.3657358721e-06"]
[null,"T898","ROOTY HILL","Urban",43,0.216502616362727,2.2041957848836402,1.7718879761429611,0,0,0,0,0,0,0,0,0,0,0,"0"]
[null,"T899","ROOTY HILL","Urban",432,2.1357148368984,2.51425376352219,3.8999724318025764,6.1634394809069994E-2,0,2,5.9382195721020001E-3,5.9382195720876366E-3,4.3703547908648659E-5,4.3703547908648659E-5,0,0,0,0,"0"]
[null,"T900","ROOTY HILL","Urban",460,2.30453625478899,4.7726260462890595,3.1436722157375119,5.4433320162000001E-3,0.35578695384294939,1,5.2444257489999997E-4,5.2444257490378394E-4,2.7314717442905412E-6,2.7314717442905412E-6,3,3.4278604654974149E-2,3.4278604654974149E-2,5.7360906630101363E-5,"5.736090663e-05"]
[null,"TM1210","TOMERONG","Short rural",468,36.632296445145997,0.79278999999999999,1.0388166398683705,0.7083135786143,1.7263442437453123,7,0.17662154041663999,0.1766215404192146,5.2419497366653703E-3,5.2419497366653703E-3,11,0.43047258845569264,0.43047258845569264,1.1028242197165176E-3,"0.0011028242197"]
[null,"TM1217","TOMERONG","Short rural",1607,15.557177816239401,5.1965900000000005,3.3703417789422274,0.13229848360999999,5.483320661081458,1,3.2989289880000001E-2,3.2989289880173904E-2,2.1561627372662683E-4,2.1561627372662683E-4,11,1.367293485560779,1.367293485560779,3.8386766109363402E-3,"0.0038386766109"]
[null,"TM1232","TOMERONG","Short rural",170,22.804517690076899,0.23324,0.38851978074739002,0.20365716425950001,0.42331829166946883,4,5.0782934502269998E-2,5.0782934502138492E-2,4.807182496200205E-4,4.807182496200205E-4,4,0.10555653741472554,0.10555653741472554,2.8984482697677708E-4,"0.00028984482698"]
[null,"TM1258","TOMERONG","Short rural",1849,19.799329206338001,2.7598799999999999,2.5936172197543108,6.3155834459012006,6.0628512413420781,7,1.5748223816833402,1.5748223816761513,1.4432151567636352E-2,1.4432151567636352E-2,14,1.5118023399667739,1.5118023399667739,3.5028807748047081E-3,"0.0035028807748"]
[null,"TM1284","TOMERONG","Short rural",901,21.193867479264,0.52219000000000004,1.8033780454652097,2.5811458251651995,5.7055758764009372,8,0.64362164646200004,0.64362164646000486,1.0190519953342053E-2,1.0190519953342053E-2,7,1.4227139372945459,1.4227139372945459,3.7962602947933972E-3,"0.0037962602948"]
[null,"ULB2","ULLADULLA","Short rural",1451,9.27562436917467,6.1560200000000007,2.1594043221224934,0.49598110395369999,4.0842000534376099,3,0.12367537379339001,0.12367537379378601,8.4125693683503584E-4,8.4125693683503584E-4,10,1.018415750592061,1.018415750592061,2.587395284719522E-3,"0.0025873952847"]
[null,"ULC2","ULLADULLA","Short rural",2245,8.6350842989738297,7.2671299999999999,3.0776868534718362,9.2142569718999994,4.8490874291263513,3,2.29762115161,2.297621151602983,2.3763741119083807E-2,2.3763741119083807E-2,10,1.2091442508218162,1.2091442508218162,3.5205542398642677E-3,"0.0035205542399"]
[null,"ULD2","ULLADULLA","Urban",922,3.8798843532101102,1.05288,3.5609740621045494,6.7049376137999998E-3,0.7161383683870195,1,6.4599306751999999E-4,6.4599306752471301E-4,9.5601511050168944E-6,9.5601511050168944E-6,4,6.8996976260779067E-2,6.8996976260779067E-2,1.5569388942456085E-4,"0.00015569388942"]
[null,"ULE2","ULLADULLA","Short rural",1492,94.646863869287202,3.2782499999999999,1.72696204229624,2.5792321537068998,12.682073339780379,13,0.64314446290908001,0.64314446290339677,1.1353433954261074E-2,1.1353433954261074E-2,36,3.1623385413075233,3.1623385413075233,8.734226432434343E-3,"0.0087342264324"]
[null,"ULF2","ULLADULLA","Short rural",1677,11.650063842597199,1.6365799999999999,3.5920170313783313,4.4058102533927999,9.2990964044680666,5,1.098610865645,1.0986108656463185,1.1897776678095506E-2,1.1897776678095506E-2,10,2.3187762892792763,2.3187762892792763,5.7474108373687747E-3,"0.0057474108374"]
[null,"ULH2","ULLADULLA","Short rural",765,81.473235424740295,2.6006499999999999,1.5255383897824402,2.4395483159898199,0.84650900524480688,14,0.60831359795969009,0.60831359796401663,4.284047930437242E-3,4.284047930437242E-3,17,0.21108126259234386,0.21108126259234386,6.9633452334664733E-4,"0.00069633452335"]
[null,"ULJ2","ULLADULLA","Urban",1885,9.0940602277845706,0.62209999999999999,3.3863510090865199,2.6780768259930001,2.0389105743655374,4,0.2580216496421,0.25802164964504526,2.8762397467379402E-3,2.8762397467379402E-3,4,0.19644061917001499,0.19644061917001499,5.408314053695272E-4,"0.00054083140537"]
[null,"ULK2","ULLADULLA","Short rural",1464,13.204039731248601,6.24878688975374,2.905197687048731,0.90895139465589991,1.0893042937193294,9,0.22665158530829999,0.2266515853098158,3.6654766533526571E-3,3.6654766533526571E-3,5,0.27162348450037116,0.27162348450037116,1.1452405358594606E-3,"0.0011452405359"]
[null,"ULL2","ULLADULLA","Short rural",533,30.209403012172999,4.69224,2.2193944791929172,0.22129129193666999,2.0424544103136126,6,5.5180092608720005E-2,5.5180092608956913E-2,4.6304478456046089E-4,4.6304478456046089E-4,10,0.50929624262132833,0.50929624262132833,1.3255098794669683E-3,"0.0013255098795"]
[null,"UNA2","UNANDERRA","Urban",3,0,0.49695,2.024482991305415,0,9.0722200270722979E-4,0,0,0,0,0,1,8.7407095817297319E-5,8.7407095817297319E-5,1.3657358721452706E-6,"1.3657358721e-06"]
[null,"UNB2","UNANDERRA","Urban",182,2.7850764175120699,0.34325,2.5559560266097754,2.8492441023E-3,8.9375542610454439E-2,1,2.7451291030000001E-4,2.7451291030119941E-4,1.3657358721452706E-6,1.3657358721452706E-6,3,8.6109646738759312E-3,8.6109646738759312E-3,2.0486038082179059E-5,"2.0486038082e-05"]
[null,"UNC2","UNANDERRA","Urban",9,1.9307274015982201,0.23552999999999999,3.5361244446384061,0,0,0,0,0,0,0,0,0,0,0,"0"]
[null,"UND2","UNANDERRA","Urban",38,0.69712003761794306,1.04453,1.3983460470189957,0,7.0876718961502329E-5,0,0,0,0,0,1,6.8286793607263528E-6,6.8286793607263528E-6,1.3657358721452706E-6,"1.3657358721e-06"]
[null,"UNE2","UNANDERRA","Urban",72,2.0612545275984697,1.1555299999999999,1.2537295040715168,0,6.5490088320428144E-2,0,0,0,0,0,1,6.3096997293111499E-3,6.3096997293111499E-3,1.5023094593597976E-5,"1.5023094594e-05"]
[null,"UNF2","UNANDERRA","Urban",588,2.9799337688712,1.7596806704272301,1.7322256292303886,1.156296968478,2.3112189286156295,3,0.1114044408269,0.11140444082676186,9.7103820509528746E-4,9.7103820509528746E-4,6,0.22267640527392565,0.22267640527392565,6.0638672723250012E-4,"0.00060638672723"]
[null,"UNG2","UNANDERRA","Urban",37,1.04174386734233,0.32217000000000001,0.43320565235218256,0,0.14097379401442814,0,0,0,0,0,1,1.3582243248484716E-2,1.3582243248484716E-2,5.3263699013665555E-5,"5.3263699014e-05"]
[null,"UNH2","UNANDERRA","Urban",414,4.3987912274881502,0.58587796481958498,1.9655254829264639,0,0.24523344760679805,0,0,0,0,0,2,2.3627230588113182E-2,2.3627230588113182E-2,8.7407095817297319E-5,"8.7407095817e-05"]
[null,"UNJ2","UNANDERRA","Urban",1532,6.8566835937899002,4.4629586727349393,3.4813851727962088,0.25646031989250001,4.6136491440800329,2,2.4708893399159999E-2,2.4708893398852235E-2,2.0267520342635817E-3,2.0267520342635817E-3,12,0.4445060543071212,0.4445060543071212,1.2004818316156927E-3,"0.0012004818316"]
[null,"W111","APPIN","Short rural",578,34.374834499656899,0.14077000000000001,2.1719917126913719,0.69829830023099992,0.36515685608965998,4,0.17412418056553,0.17412418056446338,4.1026932629251002E-3,4.1026932629251002E-3,2,9.105369198685094E-2,9.105369198685094E-2,2.262203527623626E-4,"0.00022622035276"]
[null,"W112","APPIN","Short rural",312,18.380074821936798,0.10814,1.1622060918787167,0.42528310949070008,0.58033857485678109,4,0.10604647458303,0.10604647458281913,2.277664114378707E-3,2.277664114378707E-3,2,0.14471033190767382,0.14471033190767382,2.5096320384574599E-4,"0.00025096320385"]
[null,"W113","APPIN","Short rural",736,3.9630541895575102,4.3242200000000004,2.2863070659909179,0.33918732141570002,0.90084309800069462,2,8.4578058373660003E-2,8.4578058373977444E-2,2.6471049913999647E-3,2.6471049913999647E-3,2,0.22462974090700222,0.22462974090700222,6.4684882117988049E-4,"0.00064684882118"]
[null,"W114","APPIN","Short rural",35,13.6639685404453,0.10618000000000001,0.13336791218280356,3.5068970682199996E-2,0,3,8.7446235818000005E-3,8.7446235818493014E-3,1.3799661116605281E-4,1.3799661116605281E-4,0,0,0,0,"0"]
[null,"W118","HAZELBROOK","Short rural",725,7.0832703285223895,0.68319000000000007,1.2384163274117472,0.9616978488989999,0.96895562492269827,5,0.23980417801199999,0.2398041780071401,2.8454278745890923E-3,2.8454278745890923E-3,4,0.24161394082923898,0.24161394082923898,6.5391820720370436E-4,"0.0006539182072"]
[null,"W120","HAZELBROOK","Short rural",1143,10.412417616160798,4.6383799999999997,1.7147302994931883,1.7871281178870997,1.5904735734961122,7,0.44562935208985993,0.44562935209077098,4.892015128486092E-3,4.892015128486092E-3,3,0.39659255593651693,0.39659255593651693,8.6953448093033119E-4,"0.00086953448093"]
[null,"W123","HAZELBROOK","Short rural",1021,7.2272936413441702,1.18294663848919,1.8099930939094766,2.0720383527889998,0.56673024481617262,5,0.51667314693849997,0.51667314693718858,4.7930437241525577E-3,4.7930437241525577E-3,4,0.14131702661623838,0.14131702661623838,4.8425294263193243E-4,"0.00048425294263"]
[null,"W124","HAZELBROOK","Short rural",1126,18.386247217338202,1.6815208497176799,2.1910442715746297,3.33874707406,0.70082899709133506,3,0.83253331448000001,0.83253331448163737,6.1150189106076143E-3,6.1150189106076143E-3,7,0.17475522250892511,0.17475522250892511,4.2416316142942985E-4,"0.00042416316143"]
[null,"W126","HAZELBROOK","Short rural",82,1.2015585538654501,0.14399000000000001,0.1143153532995459,0,0,0,0,0,0,0,0,0,0,0,"0"]
[null,"W127","HAZELBROOK","Short rural",971,9.9254798152807595,4.0132300000000001,1.409889357361066,0.25057755221299999,1.7352038336155,3,6.2482768371499992E-2,6.2482768371566924E-2,6.9633452334664733E-4,6.9633452334664733E-4,10,0.43268177158813759,0.43268177158813759,1.1028242197165176E-3,"0.0011028242197"]
[null,"W163","MEADOW FLAT","Short rural",245,66.821344712972206,0.10391,0.45726141319818359,1.3681758321395798,0.83216355732699887,13,0.34116150012402996,0.34116150012371427,3.3155420451733766E-3,3.3155420451733766E-3,8,0.207504153264289,0.207504153264289,5.9029373298928991E-4,"0.00059029373299"]
[null,"W164","MEADOW FLAT","Short rural",68,30.708303758623,0,0.15242047106606119,0.50251593744110001,0.2007937448179361,13,0.12530486727324999,0.12530486727227738,4.1002438938178218E-4,4.1002438938178218E-4,5,5.0068926513732286E-2,5.0068926513732286E-2,1.2371425541691703E-4,"0.00012371425542"]
[null,"W182","BOW BOWING","Urban",4,0,2.5001138247437402,4.5345090142153204,0,0,0,0,0,0,0,0,0,0,0,"0"]
[null,"W183","BOW BOWING","Urban",1,0,2.1254,2.7308667732669236,0,0,0,0,0,0,0,0,0,0,0,"0"]
[null,"W185","BOW BOWING","Urban",416,2.1406199999999997,10.8228623377028,3.7279506881574189,0.62093675947850002,0,2,5.9824694143430002E-2,5.9824694143451436E-2,5.7224333042886835E-4,5.7224333042886835E-4,0,0,0,0,"0"]
[null,"W188","BOW BOWING","Short rural",239,13.098704432348901,1.8657245984290101,1.8671507705592498,0.80861831127990014,0.19349344276490135,7,0.20163302817075002,0.20163302817150328,2.0854688770280301E-3,2.0854688770280301E-3,3,4.8248559612597643E-2,4.8248559612597643E-2,1.6966526457177193E-4,"0.00016966526457"]
[null,"W190","BOW BOWING","Urban",224,0.78742327998572703,3.31334515484824,3.2008298923872851,0.42938533881000002,0.80968146207241032,1,4.1369505303000001E-2,4.1369505303152393E-2,3.0592483536054062E-4,3.0592483536054062E-4,6,7.8009467281065711E-2,7.8009467281065711E-2,1.8027713512317571E-4,"0.00018027713512"]
[null,"W191","BOW BOWING","Urban",10,0,1.4900074155030301,4.3058783076162293,0,1.2899562850993423E-2,0,0,0,0,0,2,1.2428196436521963E-3,1.2428196436521963E-3,2.7314717442905412E-6,"2.7314717443e-06"]
[null,"W193","BOW BOWING","Urban",1,0,1.3155399999999999,3.9248271299510757,0,0,0,0,0,0,0,0,0,0,0,"0"]
[null,"W194","BOW BOWING","Urban",2,0,1.98749,4.6107192497483513,0,0,0,0,0,0,0,0,0,0,0,"0"]
[null,"W196","BOW BOWING","Urban",1068,3.61024259614494,2.4123394385362298,2.5720954492397827,0.53287952384000004,0.39506683149141397,1,5.1340742905999999E-2,5.1340742905685015E-2,9.1504303433733133E-5,9.1504303433733133E-5,3,3.8063058756688695E-2,3.8063058756688695E-2,1.4203653070310815E-4,"0.0001420365307"]
[null,"WBB2","WOMBARRA","Short rural",1049,7.4436019413675005,0.53346000000000005,1.9642121265341175,3.8071190399016701,1.7780133718682474,8,0.94932421134089984,0.94932421133659972,8.5777314974430016E-3,8.5777314974430016E-3,6,0.44335654448411155,0.44335654448411155,9.791099642996006E-4,"0.0009791099643"]
[null,"WBC2","WOMBARRA","Short rural",953,11.005688816744099,2.07911,1.6447997873680795,5.4465716693026005,1.8167120604212277,10,1.3581299402916598,1.3581299402912146,7.9907358355074069E-3,7.9907358355074069E-3,9,0.45300625640663106,0.45300625640663106,1.3078364144074087E-3,"0.0013078364144"]
[null,"WBD2","WOMBARRA","Short rural",847,8.3003772863806606,0.43351000000000001,1.1572879913456524,3.1469595737213805,0.83265969435972931,7,0.78471014017214991,0.78471014017039353,7.7783981176176159E-3,7.7783981176176159E-3,4,0.20762786751970591,0.20762786751970591,4.6657947757237282E-4,"0.00046657947757"]
[null,"WBE2","WOMBARRA","Short rural",40,5.32948263535331,7.8159999999999993E-2,0.11144984844350395,0.119608718783,0.11113469533163566,3,2.9825033426500003E-2,2.9825033427058854E-2,2.9347953544943623E-4,2.9347953544943623E-4,2,2.7711993213389418E-2,2.7711993213389418E-2,9.8971404333533626E-5,"9.8971404334e-05"]
[null,"WD1210","WINDSOR","Short rural",278,9.1937099999999994,0.83152999999999999,1.3908367984778085,6.02452111168E-3,6.5915348634197164E-3,3,1.5022445300700001E-3,1.5022445300625642E-3,1.4138772047647663E-5,1.4138772047647663E-5,1,1.6436322505390406E-3,1.6436322505390406E-3,3.5346930119119156E-6,"3.5346930119e-06"]
[null,"WD1221","WINDSOR","Short rural",348,19.496097869322902,0.89797000000000005,2.8007261558388743,0.68367683109800004,0.52243229546523362,4,0.17047824396409,0.17047824396451167,1.3714608886218234E-3,1.3714608886218234E-3,2,0.13027111095401364,0.13027111095401364,2.9691421300060089E-4,"0.000296914213"]
[null,"WD1225","WINDSOR","Short rural",820,18.809831989305302,1.6489500000000001,4.058195042133879,0.46407240507650005,0.44701946649019519,10,0.11571877982424002,0.1157187798239723,9.5083242020430525E-4,9.5083242020430525E-4,2,0.11146654413064225,0.11146654413064225,3.0044890601251282E-4,"0.00030044890601"]
[null,"WD1247","WINDSOR","Short rural",805,8.3079300000000007,10.726839999999999,4.4773513375655476,9.9227406546000003E-3,1.3608330040608447E-2,2,2.47428510838E-3,2.4742851083383406E-3,1.7673465059559576E-5,1.7673465059559576E-5,1,3.3933052914354388E-3,3.3933052914354388E-3,7.0693860238238313E-6,"7.0693860238e-06"]
[null,"WD1251","WINDSOR","Short rural",814,12.422152596592099,5.2458299999999998,3.8867220121845607,1.2332549099E-3,0.51371445903296886,1,3.0751829203999999E-4,3.0751829203633663E-4,3.5346930119119156E-6,3.5346930119119156E-6,3,0.12809727475168781,0.12809727475168781,2.9337951998868896E-4,"0.00029337951999"]
[null,"WD1258","WINDSOR","Urban",587,4.8208599999999997,3.1953100000000001,4.3439834253827438,6.9175677706999998E-3,0.26578769610563374,2,6.6647910561000001E-4,6.6647910560689203E-4,2.7314717442905412E-6,2.7314717442905412E-6,3,2.5607547602723824E-2,2.5607547602723824E-2,9.5601511050168948E-5,"9.560151105e-05"]
[null,"WD1284","WINDSOR","Short rural",276,8.5529986661789703,2.88727,2.4196749781737217,2.2964056943999998E-3,3.4233455258405626E-2,1,5.7262026793000005E-4,5.726202679297303E-4,3.5346930119119156E-6,3.5346930119119156E-6,2,8.5362836237672761E-3,8.5362836237672761E-3,2.1208158071471491E-5,"2.1208158071e-05"]
[null,"WD1288","WINDSOR","Urban",119,0.84117999999999993,1.00675,2.4196749781737217,0,1.3608330040608447E-2,0,0,0,0,0,1,1.3111064372594598E-3,1.3111064372594598E-3,4.097207616435812E-6,"4.0972076164e-06"]
[null,"WH1209","WHALAN","Urban",1140,4.5814006440450106,1.3334300000000001,2.8261295676832119,1.0064494092999999E-3,0.25295900997360182,1,9.6967246921999999E-5,9.6967246922314215E-5,1.3657358721452706E-6,1.3657358721452706E-6,1,2.4371556638432355E-2,2.4371556638432355E-2,5.8726642502246637E-5,"5.8726642502e-05"]
[null,"WH1213","WHALAN","Urban",140,0,2.8206799999999999,1.0813013058368515,0.34052010857600001,1.6656028955953046E-2,3,3.2807707120600001E-2,3.2807707120673692E-2,1.0789313389947638E-4,1.0789313389947638E-4,1,1.604739649770693E-3,1.604739649770693E-3,6.8286793607263528E-6,"6.8286793607e-06"]
[null,"WH1220","WHALAN","Urban",206,0,1.7143406213300101,1.1939603566841466,0,2.0979508812604689E-2,0,0,0,0,0,2,2.0212890907750003E-3,2.0212890907750003E-3,6.8286793607263528E-6,"6.8286793607e-06"]
[null,"WH1224","WHALAN","Urban",1361,4.7979721484525495,4.33816513218704,3.8385673046924165,2.4575510025485001,0.39010546116410882,4,0.23677489668081,0.23677489668208129,4.5629235488373488E-3,4.5629235488373488E-3,3,3.7585051201437847E-2,3.7585051201437847E-2,1.1881902087663854E-4,"0.00011881902088"]
[null,"WH1235","WHALAN","Urban",1182,6.6480113883929297,1.2047399999999999,2.8648443673339914,0.19328081260800001,1.9834141034186812,4,1.86218086167E-2,1.8621808616700763E-2,1.8027713512317573E-4,1.8027713512317573E-4,6,0.19109376323056626,0.19109376323056626,4.8483623461157105E-4,"0.00048483623461"]
[null,"WH1246","WHALAN","Urban",832,0,4.1549323233940303,4.3717950806699246,0,0,0,0,0,0,0,0,0,0,0,"0"]
[null,"WH1257","WHALAN","Urban",193,0,3.37947358427098,3.7242722741223528,2.6791399766999999E-2,8.2854884465996217E-2,1,2.5812407984E-3,2.5812407983545615E-3,2.0486038082179059E-5,2.0486038082179059E-5,2,7.9827261726891068E-3,7.9827261726891068E-3,2.0486038082179059E-5,"2.0486038082e-05"]
[null,"WH1261","WHALAN","Urban",1078,0.46351318492579402,6.36012673683262,3.2053669417426787,0,0,0,0,0,0,0,0,0,0,0,"0"]
[null,"WH1272","WHALAN","Urban",90,0.1014,1.80122147299061,2.9721991857881931,0,0,0,0,0,0,0,0,0,0,0,"0"]
[null,"WH1276","WHALAN","Urban",61,9.2860399831023302E-2,3.3659944678968001,2.1455721643732484,0,0,0,0,0,0,0,0,0,0,0,"0"]
[null,"WH1287","WHALAN","Urban",1627,2.1019312262202403,3.9144605666900802,2.3688681544850283,1.8503501512589999,0,4,0.1782736005992,0.17827360059873862,2.3313111337519765E-3,2.3313111337519765E-3,0,0,0,0,"0"]
[null,"WH1294","WHALAN","Urban",1212,6.0068178157696703,3.71688158441783,4.1979138072777626,0,0.75384478287453871,0,0,0,0,0,2,7.2629833680685485E-2,7.2629833680685485E-2,1.7481419163459464E-4,"0.00017481419163"]
[null,"WH1298","WHALAN","Short rural",55,0.35144430132069404,2.0344199999999999,0.31854862316333077,1.1311924346E-2,0,1,2.8206850235E-3,2.8206850235057085E-3,4.9485702166766813E-5,4.9485702166766813E-5,0,0,0,0,"0"]
[null,"WL1214","WEST LIVERPOOL 11KV","Urban",52,4.0619999999999996E-2,1.3000499999999999,0.36429508721262333,0,0,0,0,0,0,0,0,0,0,0,"0"]
[null,"WL1217","WEST LIVERPOOL 11KV","Urban",1583,7.1196259518942195,1.5472402301993,3.634593149629457,1.545807065208,3.0832081515443126,6,0.1489321311208,0.14893213112156964,2.3217509826469604E-3,2.3217509826469604E-3,8,0.29705438087095709,0.29705438087095709,6.5145601101329403E-4,"0.00065145601101"]
[null,"WL1218","WEST LIVERPOOL 11KV","Urban",635,0,4.63809922724269,3.0842282320217485,8.0799459615999998E-4,0,1,7.7846944711999994E-5,7.7846944712280423E-5,1.3657358721452706E-6,1.3657358721452706E-6,0,0,0,0,"0"]
[null,"WL1221","WEST LIVERPOOL 11KV","Urban",137,0.80114463774336298,1.5046400000000002,3.5738535919096317,0,0.12119918942416898,0,0,0,0,0,1,1.1677041706842063E-2,1.1677041706842063E-2,2.0486038082179059E-5,"2.0486038082e-05"]
[null,"WL1229","WEST LIVERPOOL 11KV","Short rural",4,0,2.33806,0.68051675785101295,0,0,0,0,0,0,0,0,0,0,0,"0"]
[null,"WL1233","WEST LIVERPOOL 11KV","Urban",70,0.10022,3.9773000000000001,1.5814538395930244,0,0.17605776990037178,0,0,0,0,0,1,1.6962439532044262E-2,1.6962439532044262E-2,3.1411925059341222E-5,"3.1411925059e-05"]
[null,"WL1236","WEST LIVERPOOL 11KV","Urban",2258,8.7605081065008399,1.5814115601579799,4.30651339291233,3.2012462392593797,3.4969155601226016,6,0.30842686348138004,0.30842686347831078,3.275034621404359E-3,3.275034621404359E-3,7,0.33691338229951678,0.33691338229951678,7.1427986113197655E-4,"0.00071427986113"]
[null,"WL1243","WEST LIVERPOOL 11KV","Urban",7,0,3.69896,1.0478704158496948,0,0,0,0,0,0,0,0,0,0,0,"0"]
[null,"WL1251","WEST LIVERPOOL 11KV","Urban",733,3.2485109726836199,3.86387776474225,3.5768511945072583,4.5786360449300005E-2,0.81281421305050872,3,4.4113268670500005E-3,4.4113268670292237E-3,4.9166491397229741E-5,4.9166491397229741E-5,5,7.8311294908809823E-2,7.8311294908809823E-2,2.2534641890396964E-4,"0.0002253464189"]
[null,"WL1255","WEST LIVERPOOL 11KV","Urban",4,0,0.51180999999999999,1.9378941918633841,0,0,0,0,0,0,0,0,0,0,0,"0"]
[null,"WL1258","WEST LIVERPOOL 11KV","Urban",16,0.67241999999999991,1.8640600000000001,1.7943344308486227,0,6.329291003262158E-2,0,0,0,0,0,3,6.0980106691286328E-3,6.0980106691286328E-3,1.0925886977162165E-5,"1.0925886977e-05"]
[null,"WL1262","WEST LIVERPOOL 11KV","Urban",25,0.241643359456684,1.8354900000000001,1.4818216583395099,0,0,0,0,0,0,0,0,0,0,0,"0"]
[null,"WL1273","WEST LIVERPOOL 11KV","Urban",1,0,1.3485100000000001,1.0072656023576958,0,2.1263015688450699E-4,0,0,0,0,0,1,2.0486038082179059E-5,2.0486038082179059E-5,1.3657358721452706E-6,"1.3657358721e-06"]
[null,"WL1277","WEST LIVERPOOL 11KV","Urban",777,1.4377191735983499,3.95779619227166,1.9052558883257651,0.66777209537100002,0.78014004560925609,3,6.4337085464399993E-2,6.4337085465019414E-2,1.1854587370220947E-3,1.1854587370220947E-3,3,7.5163273723514973E-2,7.5163273723514973E-2,2.417352493697129E-4,"0.00024173524937"]
[null,"WL1280","WEST LIVERPOOL 11KV","Urban",334,3.4962468753845801,2.5299099999999997,3.368492410559953,9.615135694400001E-2,0.52434596687719426,2,9.2637864207000004E-3,9.2637864207613697E-3,6.9652529479408807E-5,6.9652529479408807E-5,4,5.0518569910653559E-2,5.0518569910653559E-2,1.2291622849307436E-4,"0.00012291622849"]
[null,"WL1292","WEST LIVERPOOL 11KV","Urban",1216,6.7577739871761393,1.35558,3.6639950584981005,1.38656125303,0.99879472360549082,2,0.13358945432900002,0.13358945433388963,1.8355490121632436E-3,1.8355490121632436E-3,5,9.622974955135577E-2,9.622974955135577E-2,2.0759185256608113E-4,"0.00020759185257"]
[null,"WL1295","WEST LIVERPOOL 11KV","Urban",1061,0,5.2570258163114403,2.1656408597302925,4.5290223416000003E-2,0,1,4.3635261114999997E-3,4.3635261115041396E-3,1.4545087038347131E-3,1.4545087038347131E-3,0,0,0,0,"0"]
[null,"WL1296","WEST LIVERPOOL 11KV","Urban",139,1.2631700000000001,2.5372589919992703,2.041093012139839,0.38324459477,0,1,3.6924035038999999E-2,3.6924035039319535E-2,1.9530022971677368E-4,1.9530022971677368E-4,0,0,0,0,"0"]
[null,"WL1299","WEST LIVERPOOL 11KV","Urban",34,0.96508713423843806,1.8708900000000002,1.3842420727630174,0,0,0,0,0,0,0,0,0,0,0,"0"]
[null,"WM1112","WESTMEAD","Urban",2105,0.55745,5.2759102210622792,3.668852190842733,3.6353803183244002,0.25090358512371824,2,0.35025389030099996,0.3502538902986318,2.8625823880164872E-3,2.8625823880164872E-3,1,2.4173524936971291E-2,2.4173524936971291E-2,8.057841645657097E-5,"8.0578416457e-05"]
[null,"WM1122","WESTMEAD","Urban",1,0,2.3000000000000001E-4,0,0,0,0,0,0,0,0,0,0,0,0,"0"]
[null,"WM1142","WESTMEAD","Urban",1208,0,4.2059606356069903,2.6113691239511314,0,1.3466576602685442E-2,0,0,0,0,0,1,1.297449078538007E-3,1.297449078538007E-3,6.8286793607263528E-6,"6.8286793607e-06"]
[null,"WM1152","WESTMEAD","Urban",1,0,2.3000000000000001E-4,8.3811825476272741,0,0,0,0,0,0,0,0,0,0,0,"0"]
[null,"WM1212","WESTMEAD","Urban",1,0,2.3000000000000001E-4,7.8671064038392151,0,0,0,0,0,0,0,0,0,0,0,"0"]
[null,"WM1222","WESTMEAD","Urban",580,0.52000999999999997,2.28993,2.5819519730353817,0,0,0,0,0,0,0,0,0,0,0,"0"]
[null,"WM1242","WESTMEAD","Urban",1,0,2.3000000000000001E-4,0.77888829479175148,0,0,0,0,0,0,0,0,0,0,0,"0"]
[null,"WM1252","WESTMEAD","Urban",426,1.6470357283638901,1.0773813424099501,2.5667200872935259,1.4714006856E-2,0,1,1.4176338352999999E-3,1.4176338352867909E-3,7.2384001223699341E-5,7.2384001223699341E-5,0,0,0,0,"0"]
[null,"WP1205","WEST PARRAMATTA","Urban",10,0,2.5928460630503802,4.1553275276619051,0,0,0,0,0,0,0,0,0,0,0,"0"]
[null,"WP1209","WEST PARRAMATTA","Urban",199,0,1.5048201169558699,3.8697728558020144,0,1.0149546155287133E-2,0,0,0,0,0,1,9.7786688445601383E-4,9.7786688445601383E-4,5.4629434885810824E-6,"5.4629434886e-06"]
[null,"WP1212","WEST PARRAMATTA","Urban",721,0,2.7749710243666401,4.5758251232389551,7.5696335850999998E-3,0,1,7.2930295572999995E-4,7.2930295572557445E-4,8.194415232871624E-6,8.194415232871624E-6,0,0,0,0,"0"]
[null,"WP1223","WEST PARRAMATTA","Urban",1,0,0.95533000000000001,2.9308017858466511,0,0,0,0,0,0,0,0,0,0,0,"0"]
[null,"WP1226","WEST PARRAMATTA","Urban",131,0,1.26552,2.9313708222719703,0,0.71635099854390405,0,0,0,0,0,3,6.9017462298861243E-2,6.9017462298861243E-2,1.5842536116885138E-4,"0.00015842536117"]
[null,"WP1235","WEST PARRAMATTA","Urban",267,0,2.2233499999999999,2.7127592213042755,0,2.4948605074448819E-3,0,0,0,0,0,1,2.4036951349756762E-4,2.4036951349756762E-4,1.5023094593597976E-5,"1.5023094594e-05"]
[null,"WP1241","WEST PARRAMATTA","Urban",189,0,2.2319622787178801,4.0165029626149362,6.6383134979000002E-2,0,1,6.3957410892999996E-3,6.3957410892563019E-3,3.4143396803631763E-5,3.4143396803631763E-5,0,0,0,0,"0"]
[null,"WP1245","WEST PARRAMATTA","Urban",948,0,4.0388172686747001,3.1067883669954135,0,0,0,0,0,0,0,0,0,0,0,"0"]
[null,"WP1252","WEST PARRAMATTA","Urban",49,0,0.93755999999999995,3.3558923182851639,0,2.679139976744788E-2,0,0,0,0,0,1,2.5812407983545615E-3,2.5812407983545615E-3,4.097207616435812E-6,"4.0972076164e-06"]
[null,"WP1256","WEST PARRAMATTA","Urban",507,0,2.15102676986421,2.1677442622310039,0,0.16840308425252953,0,0,0,0,0,1,1.6224942161085814E-2,1.6224942161085814E-2,2.458324569861487E-5,"2.4583245699e-05"]
[null,"WP1257","WEST PARRAMATTA","Urban",5,0,0.70807000000000009,2.1826814683954785,0,0,0,0,0,0,0,0,0,0,0,"0"]
[null,"WP1264","WEST PARRAMATTA","Urban",877,0,2.9824499999999996,3.8811942297672375,0,2.8350687584600932E-4,0,0,0,0,0,1,2.7314717442905411E-5,2.7314717442905411E-5,2.7314717442905412E-6,"2.7314717443e-06"]
[null,"WP1271","WEST PARRAMATTA","Urban",160,0,3.12353618064015,3.8015291302233631,2.1815854095899999E-2,0,2,2.1018675072500001E-3,2.1018675072315713E-3,2.458324569861487E-5,2.458324569861487E-5,0,0,0,0,"0"]
[null,"WP1275","WEST PARRAMATTA","Urban",1141,0.18878458057345301,3.32902222632001,1.4229365496843212,0,0,0,0,0,0,0,0,0,0,0,"0"]
[null,"WP1282","WEST PARRAMATTA","Urban",107,0,1.8458299999999999,3.0672689142744707,0,4.4652332945746467E-3,0,0,0,0,0,1,4.3020679972576026E-4,4.3020679972576026E-4,2.8680453315050682E-5,"2.8680453315e-05"]
[null,"WP1286","WEST PARRAMATTA","Urban",202,0,2.6859600000000001,2.361277615025938,0.57329342899000002,7.654685647842252E-2,1,5.5234455877000002E-2,5.5234455877171178E-2,2.7587864617334467E-4,2.7587864617334467E-4,1,7.3749737095844614E-3,7.3749737095844614E-3,1.3657358721452706E-5,"1.3657358721e-05"]
[null,"WP1290","WEST PARRAMATTA","Urban",180,0,1.3606800000000001,2.537922779626772,0,0,0,0,0,0,0,0,0,0,0,"0"]
[null,"WQ1208","WETHERILL PARK","Urban",109,0.79903604777703008,1.8105799999999999,3.1874880204866294,0,0,0,0,0,0,0,0,0,0,0,"0"]
[null,"WQ1212","WETHERILL PARK","Urban",120,2.11520057082212,2.2189836543534103,3.0073473464160272,0.178294409283,6.6624115823812188E-3,2,1.71779305058E-2,1.717793050559438E-2,3.2777660931470102E-4,3.2777660931470102E-4,1,6.4189585990827715E-4,6.4189585990827715E-4,1.3657358721452706E-6,"1.3657358721e-06"]
[null,"WQ1219","WETHERILL PARK","Urban",26,1.2257181874352701,1.97899444666642,3.0506754056577328,1.67299706141E-2,0.65319984194920544,2,1.61186362336E-3,1.6118636233725973E-3,3.9606340292174606E-5,3.9606340292174606E-5,4,6.293310898845407E-2,6.293310898845407E-2,1.352078513423818E-4,"0.00013520785134"]
[null,"WQ1227","WETHERILL PARK","Urban",222,1.6663844700278501,1.01312597974533,3.0131698084107508,1.0957540751E-2,0.18399596242406005,1,1.0557138291999999E-3,1.0557138291682941E-3,4.9166491397229741E-5,4.9166491397229741E-5,3,1.7727251620445611E-2,1.7727251620445611E-2,3.5509132675777037E-5,"3.5509132676e-05"]
[null,"WQ1249","WETHERILL PARK","Urban",542,2.26435229152096,2.90044871165157,2.0751234226465147,7.1868993027100004E-3,0.20922807437435487,3,6.92428087175E-4,6.9242808717765217E-4,5.4629434885810824E-6,5.4629434885810824E-6,1,2.0158261472864192E-2,2.0158261472864192E-2,4.9166491397229741E-5,"4.9166491397e-05"]
[null,"WQ1253","WETHERILL PARK","Urban",2,0,1.4950303350186001,4.9431787812376449,0,0,0,0,0,0,0,0,0,0,0,"0"]
[null,"WQ1256","WETHERILL PARK","Short rural",1,0,1.03874,0.20931014172087567,0,0,0,0,0,0,0,0,0,0,0,"0"]
[null,"WQ1260","WETHERILL PARK","Urban",179,3.89384491385501,2.1352995485263699,3.5929569576165656,0,0,0,0,0,0,0,0,0,0,0,"0"]
[null,"WQ1264","WETHERILL PARK","Urban",252,2.27584794297168,1.5775837571565001,3.7586075255711608,0,0.23857103602441684,0,0,0,0,0,1,2.2985334728204906E-2,2.2985334728204906E-2,4.5069283780793926E-5,"4.5069283781e-05"]
[null,"WQ1271","WETHERILL PARK","Urban",11,0.61532000000000009,0.67740999999999996,3.3726890541966443,2.6791399767400002E-3,5.1031237652281675E-3,3,2.5812407983499998E-4,2.5812407983545615E-4,4.097207616435812E-6,4.097207616435812E-6,1,4.9166491397229742E-4,4.9166491397229742E-4,2.7314717442905412E-6,"2.7314717443e-06"]
[null,"WQ1275","WETHERILL PARK","Urban",31,0.56421983916290608,2.1976937066442903,4.167897135842499,0,3.5438359480751162E-3,0,0,0,0,0,1,3.4143396803631765E-4,3.4143396803631765E-4,1.3657358721452706E-6,"1.3657358721e-06"]
[null,"WQ1286","WETHERILL PARK","Urban",31,0.77873612966922701,0.66927999999999999,1.3606677065714654,0,0,0,0,0,0,0,0,0,0,0,"0"]
[null,"WQ1290","WETHERILL PARK","Urban",90,1.66202608477683,1.83748726008309,4.2804748957718912,0,5.8685923300123927E-2,0,0,0,0,0,3,5.6541465106814204E-3,5.6541465106814204E-3,1.5023094593597976E-5,"1.5023094594e-05"]
[null,"WRA2","WARILLA","Urban",2245,11.8139010595164,3.8770677237573499,4.8634730362348249,0.11864762753999999,11.787351201705738,1,1.1431209249999999E-2,1.1431209249855915E-2,7.3749737095844608E-5,7.3749737095844608E-5,22,1.1356626413878061,1.1356626413878061,3.321469641057298E-3,"0.0033214696411"]
[null,"WRB2","WARILLA","Urban",1310,5.8160447636179393,1.04921450785214,1.9231652936760273,1.8538798118820001,8.8787549349949817,3,0.17861366882910001,0.17861366883090277,2.0759185256608113E-3,2.0759185256608113E-3,13,0.85543139498993448,0.85543139498993448,2.0718213180443753E-3,"0.002071821318"]
[null,"WRC2","WARILLA","Short rural",1615,9.2813826535679684,1.70824,2.5653483030539315,2.2623848693E-2,4.3163638340679071,1,5.641370047E-3,5.641370047011417E-3,7.4228553250150223E-5,7.4228553250150223E-5,10,1.0763069527411544,1.0763069527411544,3.312007352161465E-3,"0.0033120073522"]
[null,"WRD2","WARILLA","Urban",1640,6.9001147759864701,0.52238188393531004,2.6473860812640417,0.68554797647950005,9.376210274698181,4,6.6049718248889999E-2,6.6049718248689562E-2,2.8407306140621624E-4,2.8407306140621624E-4,12,0.90335916395112847,0.90335916395112847,2.2930705293319094E-3,"0.0022930705293"]
[null,"WRE2","WARILLA","Short rural",2023,9.6421043580488597,1.5100158825197201,3.4518562468683558,8.5066238097829996E-2,2.0894456749850887,5,2.1211692764842E-2,2.1211692764483404E-2,2.0501219469089109E-4,2.0501219469089109E-4,3,0.52101374995581629,0.52101374995581629,1.1841221589904917E-3,"0.001184122159"]
[null,"WRF2","WARILLA","Urban",1445,9.0285100000000007,0.70086000000000004,2.9411155710554482,0,4.0970996162886033,0,0,0,0,0,7,0.39473863912614754,0.39473863912614754,1.0994173770769429E-3,"0.0010994173771"]
[null,"WRG2","WARILLA","Urban",37,0,3.3955700000000002,1.5118281684100481,0,0,0,0,0,0,0,0,0,0,0,"0"]
[null,"WT1215","WILTON","Short rural",412,18.087817007120602,1.5731700000000002,1.4035385043999808,0.66065607278000005,0.2588843036787834,1,0.16473790251000001,0.16473790251316672,1.4492241348838854E-3,1.4492241348838854E-3,4,6.4554098476547306E-2,6.4554098476547306E-2,1.5552649252412428E-4,"0.00015552649252"]
[null,"WT1219","WILTON","Short rural",118,0.35525000000000001,2.1868000000000003,0.4509105602370983,0.10659858531999999,0,1,2.6580891450000001E-2,2.6580891449577603E-2,1.6613057155986003E-4,1.6613057155986003E-4,0,0,0,0,"0"]
[null,"WT1252","WILTON","Short rural",570,0,9.6272099999999998,1.8480982116759919,0,0,0,0,0,0,0,0,0,0,0,"0"]
[null,"WWA2","WEST WOLLONGONG","Short rural",166,0.60762426130790304,0.53994000000000009,0.1947933620224262,0,0,0,0,0,0,0,0,0,0,0,"0"]
[null,"WWB2","WEST WOLLONGONG","Short rural",1322,8.8163146103355494,1.29505,2.489625813028312,0.12512575965,1.0399740973221236,1,3.1200735215999999E-2,3.1200735216146476E-2,3.4286522215545579E-4,3.4286522215545579E-4,5,0.2593227528189177,0.2593227528189177,8.7660386695415505E-4,"0.00087660386695"]
[null,"WWC2","WEST WOLLONGONG","Short rural",1775,8.8243292988985704,1.4953800000000002,3.2192016398331202,5.0753259160811997,0.46977089327683741,4,1.2655579512991397,1.2655579512919302,1.1169629917641654E-2,1.1169629917641654E-2,3,0.11713972641476088,0.11713972641476088,5.6201618889399456E-4,"0.00056201618889"]
[null,"WWD2","WEST WOLLONGONG","Urban",1152,3.2761681167928902,0.91390655639190399,2.6516487737715346,0,1.0800194435353725,0,0,0,0,0,3,0.10405541609874816,0.10405541609874816,4.5752151716866565E-4,"0.00045752151717"]
[null,"WWE2","WEST WOLLONGONG","Urban",405,1.37626796080377,0.13259000000000001,1.2684825355001208,0,0,0,0,0,0,0,0,0,0,0,"0"]
[null,"WWF2","WEST WOLLONGONG","Urban",1578,7.2702934491802997,0.30491000000000001,2.464415467113986,2.8634194460000002E-2,0.85378095661025699,1,2.7587864616999999E-3,2.7587864617334467E-3,2.7314717442905411E-5,2.7314717442905411E-5,2,8.225827157930965E-2,8.225827157930965E-2,1.912030221003379E-4,"0.0001912030221"]
[null,"WX1206","WEST WETHERILL PARK 11KV","Urban",43,0.29108938997726397,2.2572959854920902,2.7425478971182486,2.1609121710000002E-2,0,1,2.0819496949999999E-3,2.0819496950117045E-3,6.1233814559167772E-5,6.1233814559167772E-5,0,0,0,0,"0"]
[null,"WX1210","WEST WETHERILL PARK 11KV","Urban",40,0.575431143892285,4.1223900000000002,3.1181773516105347,2.1094618812000001E-2,9.3202885434375563E-2,1,2.0323794642E-3,2.0323794641845597E-3,5.9775866593663524E-5,5.9775866593663524E-5,2,8.9797133593551536E-3,8.9797133593551536E-3,1.7754566337888518E-5,"1.7754566338e-05"]
[null,"WX1218","WEST WETHERILL PARK 11KV","Urban",100,6.8250000000000005E-2,2.4755599999999998,2.6133759934868475,5.1964792683999998E-2,0.10270036577521688,1,5.0065933142000004E-3,5.0065933141935194E-3,1.472527445351035E-4,1.472527445351035E-4,1,9.8947563936924859E-3,9.8947563936924859E-3,3.1411925059341222E-5,"3.1411925059e-05"]
[null,"WX1228","WEST WETHERILL PARK 11KV","Short rural",39,2.2308349175508901,2.41441910141589,0.96573610467456361,0.12607302441400001,0,2,3.1436940431899998E-2,3.1436940431515042E-2,2.9232169214902268E-4,2.9232169214902268E-4,0,0,0,0,"0"]
[null,"WX1240","WEST WETHERILL PARK 11KV","Urban",7,2.08772,1.1899500000000001,1.1942042294378523,3.6015202845999998E-3,0,1,3.4699161578999999E-4,3.4699161579000991E-4,1.0205635758529704E-5,1.0205635758529704E-5,0,0,0,0,"0"]
[null,"WX1244","WEST WETHERILL PARK 11KV","Urban",186,1.9895908466985199,2.2154799999999999,3.9437983979164244,0.33826602197200001,0.30363586403107595,2,3.2590535179100003E-2,3.2590535179248273E-2,5.2520519383956153E-4,5.2520519383956153E-4,1,2.9254062381351698E-2,2.9254062381351698E-2,5.7360906630101363E-5,"5.736090663e-05"]
[null,"WX1254","WEST WETHERILL PARK 11KV","Urban",58,1.36640950239444,0.65992082505702898,2.2689584409571135,3.0355670974E-2,1.0206247530456335E-2,1,2.9246436192000001E-3,2.9246436191818145E-3,8.6018929975935739E-5,8.6018929975935739E-5,1,9.8332982794459485E-4,9.8332982794459485E-4,1.3657358721452706E-6,"1.3657358721e-06"]
[null,"WX1258","WEST WETHERILL PARK 11KV","Urban",259,2.9349097331746896,1.3618339275118501,3.1940827462014338,0.3534985670511,0.23013670646799805,6,3.4058128031520002E-2,3.4058128031489963E-2,7.914264923767492E-4,7.914264923767492E-4,2,2.2172721884278469E-2,2.2172721884278469E-2,5.4629434885810822E-5,"5.4629434886e-05"]
[null,"WX1262","WEST WETHERILL PARK 11KV","Urban",6,3.6409999999999998E-2,2.0588200000000003,1.1728450407591278,3.0870173868000001E-3,0,1,2.9742138495999999E-4,2.9742138496286565E-4,8.7476877930254595E-6,8.7476877930254595E-6,0,0,0,0,"0"]
[null,"WX1270","WEST WETHERILL PARK 11KV","Urban",74,1.15461249681861,1.87408336846059,2.9399368527458827,3.8073214442E-2,0,1,3.6681970816999998E-3,3.6681970816976371E-3,1.0788814946169521E-4,1.0788814946169521E-4,0,0,0,0,"0"]
[null,"WX1280","WEST WETHERILL PARK 11KV","Urban",99,2.1714884031248398,2.5955661354491597,3.2111601898137878,5.2584317289399995E-2,2.1404769126373704E-2,2,5.0662819531700001E-3,5.0662819531379971E-3,1.4716053244174455E-4,1.4716053244174455E-4,3,2.0622611669393587E-3,2.0622611669393587E-3,8.194415232871624E-6,"8.1944152329e-06"]
[null,"WX1284","WEST WETHERILL PARK 11KV","Urban",111,0.48310519476216901,2.7922199999999999,1.9438481165144021,5.7109821662000002E-2,0.48834059364475102,1,5.5022956225000003E-3,5.5022956225192904E-3,1.6183222419174383E-4,1.6183222419174383E-4,1,4.7049600795404573E-2,4.7049600795404573E-2,8.8772831689442586E-5,"8.8772831689e-05"]
[null,"WX1288","WEST WETHERILL PARK 11KV","Urban",69,0.81272,1.3045100000000001,1.3643867660654774,3.6015202849999997E-2,1.2757809413070419E-3,1,3.4699161582999998E-3,3.4699161583347311E-3,1.0205635759808032E-4,1.0205635759808032E-4,1,1.2291622849307436E-4,1.2291622849307436E-4,1.3657358721452706E-6,"1.3657358721e-06"]
[null,"X213","ILFORD HALL","Short rural",77,56.525283547431897,0.36972000000000005,0,0.4902928656106999,0.11836412066570889,14,0.12225698305759999,0.12225698305792304,8.1297939273965213E-4,8.1297939273965213E-4,5,2.9514686649464494E-2,2.9514686649464494E-2,1.0957548336926938E-4,"0.00010957548337"]
[null,"X217","ILFORD HALL","Short rural",225,136.97768293257269,0.15621000000000002,0,1.0531257632174897,1.6827550615839884,22,0.26260218661129003,0.26260218661530571,1.237142554168463E-3,1.237142554168463E-3,26,0.41960340744406349,0.41960340744406349,1.0710119826093103E-3,"0.0010710119826"]
[null,"X482","KANDOS","Short rural",181,151.89316707053601,0.69298000000000004,0.72399723756379064,0.4891146189633,1.6362882846328273,10,0.12196318135228,0.1219631813522416,8.5578131175640651E-4,8.5578131175640651E-4,19,0.40801668375101624,0.40801668375101624,1.0498038245378388E-3,"0.0010498038245"]
[null,"X858","WEST PENNANT HILLS","Urban",551,0,6.3001768793432804,3.1751318009655476,3.2092978345699998E-2,4.3376552004439427E-2,2,3.09202601457E-3,3.0920260145368924E-3,4.9166491397229748E-5,4.9166491397229748E-5,1,4.1791517687645276E-3,4.1791517687645276E-3,2.32175098264696E-5,"2.3217509826e-05"]
[null,"X859","WEST PENNANT HILLS","Urban",468,0,3.3853283391728599,2.3827485787167899,9.6108830911999996E-3,2.8067180708754923E-2,2,9.2596892132E-4,9.2596892131449344E-4,2.7314717442905412E-6,2.7314717442905412E-6,1,2.7041570268476357E-3,2.7041570268476357E-3,1.5023094593597976E-5,"1.5023094594e-05"]
[null,"X863","WEST PENNANT HILLS","Urban",481,4.3963339721033199,1.8075123477213499,3.2113469048908434,0,0,0,0,0,0,0,0,0,0,0,"0"]
[null,"X866","WEST PENNANT HILLS","Urban",838,0,7.5605358859686103,3.6725121874042066,0.16570976893,2.8917701336292949E-2,1,1.5965452344999999E-2,1.5965452345378214E-2,1.8970071264097809E-3,1.8970071264097809E-3,1,2.7861011791763522E-3,2.7861011791763522E-3,2.32175098264696E-5,"2.3217509826e-05"]
[null,"X867","WEST PENNANT HILLS","Urban",984,1.7278101883735402,5.2119027134131999,3.8662367008732823,2.3970506353E-2,1.7860933178298587E-2,1,2.3094593597999999E-3,2.3094593597976524E-3,2.5948981570760141E-5,2.5948981570760141E-5,1,1.720827198903041E-3,1.720827198903041E-3,9.5601511050168944E-6,"9.560151105e-06"]
[null,"X869","WEST PENNANT HILLS","Urban",2,0,2.2180458267502199,1.2979416020454135,0,0,0,0,0,0,0,0,0,0,0,"0"]
[null,"X870","WEST PENNANT HILLS","Urban",702,0,6.2094514289048304,3.4515615672909559,0,4.2526031376901398E-2,0,0,0,0,0,1,4.0972076164358115E-3,4.0972076164358115E-3,6.8286793607263526E-5,"6.8286793607e-05"]
[null,"X871","WEST PENNANT HILLS","Urban",821,1.87138214104557,5.8647499733847601,3.9426368269098551,0.76904075141999995,6.3789047065352092E-3,1,7.4093902535999998E-2,7.4093902535625214E-2,1.1226348869034124E-3,1.1226348869034124E-3,1,6.1458114246537175E-4,6.1458114246537175E-4,4.097207616435812E-6,"4.0972076164e-06"]
[null,"X877","BRINGELLY","Short rural",1262,96.913176117987305,3.47799440001952,9.2621652493655553,1.7760429990742996,2.8289024839104422,18,0.44286522215335,0.44286522215545582,2.746456470255558E-3,2.746456470255558E-3,19,0.70540101092220142,0.70540101092220142,1.7390689618606624E-3,"0.0017390689619"]
[null,"X879","BRINGELLY","Short rural",671,25.6649647866819,1.45594,2.8277147405822984,0.84996778912760007,0.38273428239211255,5,0.2119437276884,0.21194372768725034,2.5944646707433457E-3,2.5944646707433457E-3,1,9.5436711321621723E-2,9.5436711321621723E-2,1.9087342264324344E-4,"0.00019087342264"]
[null,"X881","BRINGELLY","Short rural",502,25.3607356111314,2.6244899999999998,2.6873050026362431,0.61606044121729986,1.5381665549025234,7,0.15361775830037,0.15361775829769186,1.9829627796825846E-3,1.9829627796825846E-3,8,0.38354953872256192,0.38354953872256192,8.6246509490650733E-4,"0.00086246509491"]
[null,"X883","BRINGELLY","Urban",88,7.6279114320437404,0.40991000000000005,2.3584425942641096,6.5872822602340009E-2,0.37507959674427033,5,6.3465745979809996E-3,6.3465745978590719E-3,2.8680453315050682E-5,2.8680453315050682E-5,1,3.6137371176963862E-2,3.6137371176963862E-2,6.6921057735118259E-5,"6.6921057735e-05"]
[null,"YYA2","YATTE YATTAH","Short rural",753,41.838521185978806,0.27775006588937601,1.4067653727895073,0.81533338331609995,1.8935849498068731,3,0.20330746503271999,0.20330746503149877,3.8316072249075673E-3,3.8316072249075673E-3,13,0.47217489661022938,0.47217489661022938,1.3396486515146161E-3,"0.0013396486515"]
[null,"YYB2","YATTE YATTAH","Short rural",1191,30.394778546538202,2.5698540145483797,2.3644682835535944,1.42697919912472,8.0316222146233134,11,0.35582441436838996,0.35582441436441087,5.7120639072467914E-3,5.7120639072467914E-3,18,2.002725248312184,2.002725248312184,4.916757979569474E-3,"0.0049167579796"]

{"sheet":"3.6.9 Network-reliability","index":8,"n_rows":22,"n_cols":3,"rows_kept":22,"cut":false,"hidden":false,"merged":[]}
[null,{"$f":"IF(dms_DataQuality=\"backcast\",INDEX(dms_Worksheet_List,MATCH(dms_Model,dms_Model_List))&\" BACKCAST\",INDEX(dms_Worksheet_List,MATCH(dms_Model,dms_Model_List)))","v":"ANNUAL REPORTING STATEMENT"}]
[null,{"$f":"INDEX(dms_TradingNameFull_List,MATCH(dms_TradingName,dms_TradingName_List))","v":"Endeavour Energy"}]
[null,{"$f":"CONCATENATE(\"Annual Reporting RIN Response \",IF(SUM(dms_SingleYear_Model)>0,CONCATENATE(CRY),CONCATENATE(FRCP_y1,\" to \",dms_MultiYear_FinalYear_Result)))","v":"Annual Reporting RIN Response 2017-18"}]
[null,"3.6 QUALITY OF SERVICES"]
[]
[]
[null,"3.6.9 - NETWORK FEEDER RELIABILITY - PLANNED OUTAGES"]
[null,null,{"$f":"CRY","v":"2017-18"}]
[null,"3.6.9.1 - PLANNED MINUTES OFF SUPPLY (SAIDI)"]
[null,{"$f":"INDEX(dms_FeederName_1,MATCH(dms_TradingName,dms_TradingName_List))","v":"CBD"}]
[null,{"$f":"INDEX(dms_FeederName_2,MATCH(dms_TradingName,dms_TradingName_List))","v":"Urban"},52.685174663960623]
[null,{"$f":"INDEX(dms_FeederName_3,MATCH(dms_TradingName,dms_TradingName_List))","v":"Short rural"},135.71309740870882]
[null,{"$f":"INDEX(dms_FeederName_4,MATCH(dms_TradingName,dms_TradingName_List))","v":"Long rural"},646.62539682539682]
[null,{"$f":"IF((INDEX(dms_FeederName_5,MATCH(dms_TradingName,dms_TradingName_List))=0),\"\",(INDEX(dms_FeederName_5,MATCH(dms_TradingName,dms_TradingName_List))))","v":"  "}]
[]
[null,null,{"$f":"CRY","v":"2017-18"}]
[null,"3.6.9.2 - PLANNED INTERRUPTIONS TO SUPPLY (SAIFI)"]
[null,{"$f":"INDEX(dms_FeederName_1,MATCH(dms_TradingName,dms_TradingName_List))","v":"CBD"}]
[null,{"$f":"INDEX(dms_FeederName_2,MATCH(dms_TradingName,dms_TradingName_List))","v":"Urban"},0.1393159848457946]
[null,{"$f":"INDEX(dms_FeederName_3,MATCH(dms_TradingName,dms_TradingName_List))","v":"Short rural"},0.35491145594005169]
[null,{"$f":"INDEX(dms_FeederName_4,MATCH(dms_TradingName,dms_TradingName_List))","v":"Long rural"},1.7015873015873015]
[null,{"$f":"IF((INDEX(dms_FeederName_5,MATCH(dms_TradingName,dms_TradingName_List))=0),\"\",(INDEX(dms_FeederName_5,MATCH(dms_TradingName,dms_TradingName_List))))","v":"  "}]

{"sheet":"4.1 Public lighting","index":9,"n_rows":52,"n_cols":4,"rows_kept":52,"cut":false,"hidden":false,"merged":[[5,1,5,2]]}
[null,{"$f":"IF(dms_DataQuality=\"backcast\",INDEX(dms_Worksheet_List,MATCH(dms_Model,dms_Model_List))&\" BACKCAST\",INDEX(dms_Worksheet_List,MATCH(dms_Model,dms_Model_List)))","v":"ANNUAL REPORTING STATEMENT"}]
[null,{"$f":"INDEX(dms_TradingNameFull_List,MATCH(dms_TradingName,dms_TradingName_List))","v":"Endeavour Energy"}]
[null,{"$f":"CONCATENATE(\"Annual Reporting RIN Response \",IF(SUM(dms_SingleYear_Model)>0,CONCATENATE(CRY),CONCATENATE(FRCP_y1,\" to \",dms_MultiYear_FinalYear_Result)))","v":"Annual Reporting RIN Response 2017-18"}]
[null,"4.1 PUBLIC LIGHTING"]
[]
[null,"Tables 4.1.1 - 4.1.3 deliberately omitted."]
[]
[null,"4.1.4 - PUBLIC LIGHTING METRICS BY TARIFF"]
[null,null,"Number of Lights","Public Lighting Revenue"]
[null,"Tariff categories","0's","$0's, nominal"]
[]
[]
[]
[]
[]
[]
[]
[]
[]
[]
[]
[]
[]
[]
[]
[]
[]
[]
[]
[]
[]
[]
[]
[]
[]
[]
[]
[]
[]
[]
[]
[]
[]
[]
[]
[]
[]
[]
[]
[]
[null,"To enter further tariff categories - please insert new rows above this row. "]
[null,"Total ",{"$f":"SUM(C11:C50)","v":0},{"$f":"SUM(D11:D50)","v":0}]

{"sheet":"6.2 STPIS Reliability","index":10,"n_rows":94,"n_cols":5,"rows_kept":94,"cut":false,"hidden":false,"merged":[[76,1,81,1],[82,1,87,1],[88,1,93,1],[75,1,75,2],[22,1,27,1],[32,1,37,1],[38,1,43,1],[44,1,49,1],[5,1,5,2],[31,1,31,2],[66,1,71,1],[60,1,65,1],[53,1,53,2],[54,1,59,1],[16,1,21,1],[9,1,9,2],[10,1,15,1]]}
[null,{"$f":"IF(dms_DataQuality=\"backcast\",INDEX(dms_Worksheet_List,MATCH(dms_Model,dms_Model_List))&\" BACKCAST\",INDEX(dms_Worksheet_List,MATCH(dms_Model,dms_Model_List)))","v":"ANNUAL REPORTING STATEMENT"}]
[null,{"$f":"INDEX(dms_TradingNameFull_List,MATCH(dms_TradingName,dms_TradingName_List))","v":"Endeavour Energy"}]
[null,{"$f":"CONCATENATE(\"Annual Reporting RIN Response \",IF(SUM(dms_SingleYear_Model)>0,CONCATENATE(CRY),CONCATENATE(FRCP_y1,\" to \",dms_MultiYear_FinalYear_Result)))","v":"Annual Reporting RIN Response 2017-18"}]
[null,"6.2 RELIABILITY AND CUSTOMER SERVICE PERFORMANCE"]
[]
[null,"Did the MAIFI parameter of the STPIS apply during the period?\nNB:This flag is set from the response on worksheet 3.6.8 Network feeders",null,{"$f":"dms_MAIFI_Flag","v":"No"}]
[]
[]
[null,"6.2.1 - UNPLANNED MINUTES OFF SUPPLY (SAIDI)"]
[null,null,null,{"$f":"CRY","v":"2017-18"}]
[null,"Total sustained minutes off supply",{"$f":"INDEX(dms_FeederName_1,MATCH(dms_TradingName,dms_TradingName_List))","v":"CBD"}]
[null,null,{"$f":"INDEX(dms_FeederName_2,MATCH(dms_TradingName,dms_TradingName_List))","v":"Urban"},48.634773401050374]
[null,null,{"$f":"INDEX(dms_FeederName_3,MATCH(dms_TradingName,dms_TradingName_List))","v":"Short rural"},126.88388217841766]
[null,null,{"$f":"INDEX(dms_FeederName_4,MATCH(dms_TradingName,dms_TradingName_List))","v":"Long rural"},493.05396825396826]
[null,null,{"$f":"IF((INDEX(dms_FeederName_5,MATCH(dms_TradingName,dms_TradingName_List))=0),\"\",(INDEX(dms_FeederName_5,MATCH(dms_TradingName,dms_TradingName_List))))","v":"  "},null,""]
[null,null,"Whole Network",70.573681520443685,""]
[null,"Total of excluded events*\n\n*see 3.3 of STPIS",{"$f":"INDEX(dms_FeederName_1,MATCH(dms_TradingName,dms_TradingName_List))","v":"CBD"}]
[null,null,{"$f":"INDEX(dms_FeederName_2,MATCH(dms_TradingName,dms_TradingName_List))","v":"Urban"},0]
[null,null,{"$f":"INDEX(dms_FeederName_3,MATCH(dms_TradingName,dms_TradingName_List))","v":"Short rural"},0]
[null,null,{"$f":"INDEX(dms_FeederName_4,MATCH(dms_TradingName,dms_TradingName_List))","v":"Long rural"},0]
[null,null,{"$f":"IF((INDEX(dms_FeederName_5,MATCH(dms_TradingName,dms_TradingName_List))=0),\"\",(INDEX(dms_FeederName_5,MATCH(dms_TradingName,dms_TradingName_List))))","v":"  "},null,""]
[null,null,"Whole Network",0,""]
[null,"Total sustained minutes off supply after removing excluded events",{"$f":"INDEX(dms_FeederName_1,MATCH(dms_TradingName,dms_TradingName_List))","v":"CBD"}]
[null,null,{"$f":"INDEX(dms_FeederName_2,MATCH(dms_TradingName,dms_TradingName_List))","v":"Urban"},48.634773401050374]
[null,null,{"$f":"INDEX(dms_FeederName_3,MATCH(dms_TradingName,dms_TradingName_List))","v":"Short rural"},126.88388217841766]
[null,null,{"$f":"INDEX(dms_FeederName_4,MATCH(dms_TradingName,dms_TradingName_List))","v":"Long rural"},493.05396825396826]
[null,null,{"$f":"IF((INDEX(dms_FeederName_5,MATCH(dms_TradingName,dms_TradingName_List))=0),\"\",(INDEX(dms_FeederName_5,MATCH(dms_TradingName,dms_TradingName_List))))","v":"  "},null,""]
[null,null,"Whole Network",70.573681520443685,""]
[]
[]
[null,"6.2.2 - UNPLANNED INTERRUPTIONS TO SUPPLY (SAIFI)"]
[null,null,null,{"$f":"CRY","v":"2017-18"}]
[null,"Total sustained interruptions",{"$f":"INDEX(dms_FeederName_1,MATCH(dms_TradingName,dms_TradingName_List))","v":"CBD"}]
[null,null,{"$f":"INDEX(dms_FeederName_2,MATCH(dms_TradingName,dms_TradingName_List))","v":"Urban"},0.55847723963061247]
[null,null,{"$f":"INDEX(dms_FeederName_3,MATCH(dms_TradingName,dms_TradingName_List))","v":"Short rural"},1.2333166529239032]
[null,null,{"$f":"INDEX(dms_FeederName_4,MATCH(dms_TradingName,dms_TradingName_List))","v":"Long rural"},3.4349206349206347]
[null,null,{"$f":"IF((INDEX(dms_FeederName_5,MATCH(dms_TradingName,dms_TradingName_List))=0),\"\",(INDEX(dms_FeederName_5,MATCH(dms_TradingName,dms_TradingName_List))))","v":"  "},null,""]
[null,null,"Whole Network",0.74738707012064209,""]
[null,"Total of excluded events*\n\n*see 3.3 of STPIS",{"$f":"INDEX(dms_FeederName_1,MATCH(dms_TradingName,dms_TradingName_List))","v":"CBD"}]
[null,null,{"$f":"INDEX(dms_FeederName_2,MATCH(dms_TradingName,dms_TradingName_List))","v":"Urban"},0]
[null,null,{"$f":"INDEX(dms_FeederName_3,MATCH(dms_TradingName,dms_TradingName_List))","v":"Short rural"},0]
[null,null,{"$f":"INDEX(dms_FeederName_4,MATCH(dms_TradingName,dms_TradingName_List))","v":"Long rural"},0]
[null,null,{"$f":"IF((INDEX(dms_FeederName_5,MATCH(dms_TradingName,dms_TradingName_List))=0),\"\",(INDEX(dms_FeederName_5,MATCH(dms_TradingName,dms_TradingName_List))))","v":"  "},null,""]
[null,null,"Whole Network",0,""]
[null,"Total sustained interruptions after removing excluded events",{"$f":"INDEX(dms_FeederName_1,MATCH(dms_TradingName,dms_TradingName_List))","v":"CBD"}]
[null,null,{"$f":"INDEX(dms_FeederName_2,MATCH(dms_TradingName,dms_TradingName_List))","v":"Urban"},0.55847723963061247]
[null,null,{"$f":"INDEX(dms_FeederName_3,MATCH(dms_TradingName,dms_TradingName_List))","v":"Short rural"},1.2333166529239032]
[null,null,{"$f":"INDEX(dms_FeederName_4,MATCH(dms_TradingName,dms_TradingName_List))","v":"Long rural"},3.4349206349206347]
[null,null,{"$f":"IF((INDEX(dms_FeederName_5,MATCH(dms_TradingName,dms_TradingName_List))=0),\"\",(INDEX(dms_FeederName_5,MATCH(dms_TradingName,dms_TradingName_List))))","v":"  "},null,""]
[null,null,"Whole Network",0.74738707012064209,""]
[]
[]
[null,"6.2.3 - UNPLANNED MOMENTARY INTERRUPTIONS TO SUPPLY (MAIFI)"]
[null,null,null,{"$f":"CRY","v":"2017-18"}]
[null,"Total momentary interruptions",{"$f":"INDEX(dms_FeederName_1,MATCH(dms_TradingName,dms_TradingName_List))","v":"CBD"}]
[null,null,{"$f":"INDEX(dms_FeederName_2,MATCH(dms_TradingName,dms_TradingName_List))","v":"Urban"}]
[null,null,{"$f":"INDEX(dms_FeederName_3,MATCH(dms_TradingName,dms_TradingName_List))","v":"Short rural"}]
[null,null,{"$f":"INDEX(dms_FeederName_4,MATCH(dms_TradingName,dms_TradingName_List))","v":"Long rural"}]
[null,null,{"$f":"IF((INDEX(dms_FeederName_5,MATCH(dms_TradingName,dms_TradingName_List))=0),\"\",(INDEX(dms_FeederName_5,MATCH(dms_TradingName,dms_TradingName_List))))","v":"  "}]
[null,null,"Whole Network"]
[null,"Total of excluded events*\n\n*see 3.3 of STPIS",{"$f":"INDEX(dms_FeederName_1,MATCH(dms_TradingName,dms_TradingName_List))","v":"CBD"}]
[null,null,{"$f":"INDEX(dms_FeederName_2,MATCH(dms_TradingName,dms_TradingName_List))","v":"Urban"}]
[null,null,{"$f":"INDEX(dms_FeederName_3,MATCH(dms_TradingName,dms_TradingName_List))","v":"Short rural"}]
[null,null,{"$f":"INDEX(dms_FeederName_4,MATCH(dms_TradingName,dms_TradingName_List))","v":"Long rural"}]
[null,null,{"$f":"IF((INDEX(dms_FeederName_5,MATCH(dms_TradingName,dms_TradingName_List))=0),\"\",(INDEX(dms_FeederName_5,MATCH(dms_TradingName,dms_TradingName_List))))","v":"  "}]
[null,null,"Whole Network"]
[null,"Total momentary interruptions after removing excluded events",{"$f":"INDEX(dms_FeederName_1,MATCH(dms_TradingName,dms_TradingName_List))","v":"CBD"}]
[null,null,{"$f":"INDEX(dms_FeederName_2,MATCH(dms_TradingName,dms_TradingName_List))","v":"Urban"}]
[null,null,{"$f":"INDEX(dms_FeederName_3,MATCH(dms_TradingName,dms_TradingName_List))","v":"Short rural"}]
[null,null,{"$f":"INDEX(dms_FeederName_4,MATCH(dms_TradingName,dms_TradingName_List))","v":"Long rural"}]
[null,null,{"$f":"IF((INDEX(dms_FeederName_5,MATCH(dms_TradingName,dms_TradingName_List))=0),\"\",(INDEX(dms_FeederName_5,MATCH(dms_TradingName,dms_TradingName_List))))","v":"  "}]
[null,null,"Whole Network"]
[]
[]
[null,"6.2.4 - DISTRIBUTION CUSTOMER NUMBERS"]
[null,null,null,{"$f":"CRY","v":"2017-18"}]
[null,"Customer numbers at the start of the period",{"$f":"INDEX(dms_FeederName_1,MATCH(dms_TradingName,dms_TradingName_List))","v":"CBD"}]
[null,null,{"$f":"INDEX(dms_FeederName_2,MATCH(dms_TradingName,dms_TradingName_List))","v":"Urban"},727843]
[null,null,{"$f":"INDEX(dms_FeederName_3,MATCH(dms_TradingName,dms_TradingName_List))","v":"Short rural"},278538]
[null,null,{"$f":"INDEX(dms_FeederName_4,MATCH(dms_TradingName,dms_TradingName_List))","v":"Long rural"},314]
[null,null,{"$f":"IF((INDEX(dms_FeederName_5,MATCH(dms_TradingName,dms_TradingName_List))=0),\"\",(INDEX(dms_FeederName_5,MATCH(dms_TradingName,dms_TradingName_List))))","v":"  "}]
[null,null,"Whole Network",1006695]
[null,"Customer numbers at the end of the period",{"$f":"INDEX(dms_FeederName_1,MATCH(dms_TradingName,dms_TradingName_List))","v":"CBD"}]
[null,null,{"$f":"INDEX(dms_FeederName_2,MATCH(dms_TradingName,dms_TradingName_List))","v":"Urban"},736569]
[null,null,{"$f":"INDEX(dms_FeederName_3,MATCH(dms_TradingName,dms_TradingName_List))","v":"Short rural"},287282]
[null,null,{"$f":"INDEX(dms_FeederName_4,MATCH(dms_TradingName,dms_TradingName_List))","v":"Long rural"},315]
[null,null,{"$f":"IF((INDEX(dms_FeederName_5,MATCH(dms_TradingName,dms_TradingName_List))=0),\"\",(INDEX(dms_FeederName_5,MATCH(dms_TradingName,dms_TradingName_List))))","v":"  "}]
[null,null,"Whole Network",1024166]
[null,"Average customer numbers",{"$f":"INDEX(dms_FeederName_1,MATCH(dms_TradingName,dms_TradingName_List))","v":"CBD"},{"$f":"IFERROR(ROUND(AVERAGE(D77,D83),0),\"\")","v":""}]
[null,null,{"$f":"INDEX(dms_FeederName_2,MATCH(dms_TradingName,dms_TradingName_List))","v":"Urban"},{"$f":"IFERROR(ROUND(AVERAGE(D78,D84),0),\"\")","v":732206}]
[null,null,{"$f":"INDEX(dms_FeederName_3,MATCH(dms_TradingName,dms_TradingName_List))","v":"Short rural"},{"$f":"IFERROR(ROUND(AVERAGE(D79,D85),0),\"\")","v":282910}]
[null,null,{"$f":"INDEX(dms_FeederName_4,MATCH(dms_TradingName,dms_TradingName_List))","v":"Long rural"},{"$f":"IFERROR(ROUND(AVERAGE(D80,D86),0),\"\")","v":315}]
[null,null,{"$f":"IF((INDEX(dms_FeederName_5,MATCH(dms_TradingName,dms_TradingName_List))=0),\"\",(INDEX(dms_FeederName_5,MATCH(dms_TradingName,dms_TradingName_List))))","v":"  "}]
[null,null,"Whole Network",{"$f":"IFERROR(ROUND(AVERAGE(D82,D88),0),\"\")","v":1015431}]

{"sheet":"6.6 STPIS Customer Service","index":11,"n_rows":12,"n_cols":4,"rows_kept":12,"cut":false,"hidden":false,"merged":[]}
[null,{"$f":"IF(dms_DataQuality=\"backcast\",INDEX(dms_Worksheet_List,MATCH(dms_Model,dms_Model_List))&\" BACKCAST\",INDEX(dms_Worksheet_List,MATCH(dms_Model,dms_Model_List)))","v":"ANNUAL REPORTING STATEMENT"}]
[null,{"$f":"INDEX(dms_TradingNameFull_List,MATCH(dms_TradingName,dms_TradingName_List))","v":"Endeavour Energy"}]
[null,{"$f":"CONCATENATE(\"Annual Reporting RIN Response \",IF(SUM(dms_SingleYear_Model)>0,CONCATENATE(CRY),CONCATENATE(FRCP_y1,\" to \",dms_MultiYear_FinalYear_Result)))","v":"Annual Reporting RIN Response 2017-18"}]
[null,"6.6 STPIS CUSTOMER SERVICE"]
[]
[]
[null,"6.6.1 - TELEPHONE ANSWERING"]
[null,null,"Number of calls \nafter removing excluded events","Total number of calls"]
[null,null,{"$f":"CRY","v":"2017-18"},{"$f":"CRY","v":"2017-18"}]
[null,"Number of calls received",186189,222684]
[null,"Number of calls answered within 30 seconds",155649]
[null,"Percentage of calls answered within 30 seconds",{"$f":"IFERROR(C11/C10,\"\")","v":0.83597312408359248}]

{"sheet":"6.7 STPIS Daily Performance","index":12,"n_rows":380,"n_cols":16,"rows_kept":380,"cut":false,"hidden":false,"merged":[[12,14,12,15],[12,3,13,3],[6,1,6,5],[8,1,8,6],[12,4,12,5],[12,6,12,7],[12,10,12,11],[12,8,12,9],[12,12,12,13],[11,1,13,1],[11,2,11,3],[12,2,13,2],[11,4,11,13]]}
[null,{"$f":"IF(dms_DataQuality=\"backcast\",INDEX(dms_Worksheet_List,MATCH(dms_Model,dms_Model_List))&\" BACKCAST\",INDEX(dms_Worksheet_List,MATCH(dms_Model,dms_Model_List)))","v":"ANNUAL REPORTING STATEMENT"},null,null,null,null,null,null,"1-Jul-2016"]
[null,{"$f":"INDEX(dms_TradingNameFull_List,MATCH(dms_TradingName,dms_TradingName_List))","v":"Endeavour Energy"}]
[null,{"$f":"CONCATENATE(\"Annual Reporting RIN Response \",IF(SUM(dms_SingleYear_Model)>0,CONCATENATE(CRY),CONCATENATE(FRCP_y1,\" to \",dms_MultiYear_FinalYear_Result)))","v":"Annual Reporting RIN Response 2017-18"}]
[null,"6.7 STPIS DAILY PERFORMANCE"]
[]
[]
[null,"Did the MAIFI parameter of the STPIS apply during the period?\nThis flag is set from the response on worksheet 3.6.8 Network feeders",null,null,null,null,{"$f":"dms_MAIFI_Flag","v":"No"}]
[]
[null,"The excluded events to be removed from the data refer only to events listed in clause 3.3(a) of the STPIS, with respect to reliability data, and in clause 5.4 of the STPIS with respect to customer service parameters.\n\n*Customer service information must be reported as per the definitions in the STPIS, that is excluding: \n   • calls to payment lines and automated interactive services \n   • calls abandoned by the customer within 30 seconds of the call being queued for response by a human operator (where the time in which a telephone call is abandoned is not measured, then an estimate of the number of calls abandoned within 30 seconds will be determined by taking 20 per cent of all calls abadoned)."]
[]
[null,"6.7.1 - DAILY PERFORMANCE DATA - UNPLANNED"]
[null,"Date","Customer service*",null,"MAIFI"]
[null,null,"Number of calls received\n(after removing excluded events)","Number of calls answered in 30 seconds\n(after removing excluded events)",{"$f":"INDEX(dms_FeederName_1,MATCH(dms_TradingName,dms_TradingName_List))","v":"CBD"},null,{"$f":"INDEX(dms_FeederName_2,MATCH(dms_TradingName,dms_TradingName_List))","v":"Urban"},null,{"$f":"INDEX(dms_FeederName_3,MATCH(dms_TradingName,dms_TradingName_List))","v":"Short rural"},null,{"$f":"INDEX(dms_FeederName_4,MATCH(dms_TradingName,dms_TradingName_List))","v":"Long rural"},null,{"$f":"IF((INDEX(dms_FeederName_5,MATCH(dms_TradingName,dms_TradingName_List))=0),\"Network\",(INDEX(dms_FeederName_5,MATCH(dms_TradingName,dms_TradingName_List))))","v":"  "},null,"Network"]
[null,null,null,null,"All events","After removing excluded events","All events","After removing excluded events","All events","After removing excluded events","All events","After removing excluded events","All events","After removing excluded events","All events","After removing excluded events"]
[null,{"$f":"dms_060701_StartDateTxt","v":"1-Jul-2017"},158,156]
[null,{"$f":"B15+1","v":"2017-07-02"},174,173]
[null,"2017-07-03",709,697]
[null,"2017-07-04",876,859]
[null,"2017-07-05",738,725]
[null,"2017-07-06",677,671]
[null,"2017-07-07",651,644]
[null,"2017-07-08",266,254]
[null,"2017-07-09",124,121]
[null,"2017-07-10",670,660]
[null,"2017-07-11",628,618]
[null,"2017-07-12",618,612]
[null,"2017-07-13",648,643]
[null,"2017-07-14",706,700]
[null,"2017-07-15",291,282]
[null,"2017-07-16",105,104]
[null,"2017-07-17",666,658]
[null,"2017-07-18",651,644]
[null,"2017-07-19",761,747]
[null,"2017-07-20",605,596]
[null,"2017-07-21",657,648]
[null,"2017-07-22",201,199]
[null,"2017-07-23",237,226]
[null,"2017-07-24",679,671]
[null,"2017-07-25",706,698]
[null,"2017-07-26",918,887]
[null,"2017-07-27",610,595]
[null,"2017-07-28",691,665]
[null,"2017-07-29",175,170]
[null,"2017-07-30",123,121]
[null,"2017-07-31",743,721]
[null,"2017-08-01",771,753]
[null,"2017-08-02",701,682]
[null,"2017-08-03",704,695]
[null,"2017-08-04",619,610]
[null,"2017-08-05",264,261]
[null,"2017-08-06",126,125]
[null,"2017-08-07",651,643]
[null,"2017-08-08",862,831]
[null,"2017-08-09",646,638]
[null,"2017-08-10",598,596]
[null,"2017-08-11",636,623]
[null,"2017-08-12",236,232]
[null,"2017-08-13",139,136]
[null,"2017-08-14",605,595]
[null,"2017-08-15",633,618]
[null,"2017-08-16",946,933]
[null,"2017-08-17",692,680]
[null,"2017-08-18",1211,1166]
[null,"2017-08-19",378,367]
[null,"2017-08-20",113,109]
[null,"2017-08-21",677,669]
[null,"2017-08-22",797,777]
[null,"2017-08-23",662,656]
[null,"2017-08-24",616,608]
[null,"2017-08-25",542,533]
[null,"2017-08-26",191,189]
[null,"2017-08-27",281,267]
[null,"2017-08-28",667,648]
[null,"2017-08-29",610,595]
[null,"2017-08-30",594,587]
[null,"2017-08-31",640,632]
[null,"2017-09-01",570,561]
[null,"2017-09-02",155,153]
[null,"2017-09-03",103,101]
[null,{"$f":"B79+1","v":"2017-09-04"},689,677]
[null,"2017-09-05",592,588]
[null,"2017-09-06",731,715]
[null,"2017-09-07",713,708]
[null,"2017-09-08",605,596]
[null,"2017-09-09",191,191]
[null,"2017-09-10",70,70]
[null,"2017-09-11",641,631]
[null,"2017-09-12",641,636]
[null,"2017-09-13",863,843]
[null,"2017-09-14",708,689]
[null,"2017-09-15",587,581]
[null,"2017-09-16",219,213]
[null,"2017-09-17",133,133]
[null,"2017-09-18",598,589]
[null,"2017-09-19",555,551]
[null,"2017-09-20",548,541]
[null,"2017-09-21",703,693]
[null,"2017-09-22",537,532]
[null,"2017-09-23",263,256]
[null,"2017-09-24",357,341]
[null,"2017-09-25",630,618]
[null,"2017-09-26",676,660]
[null,"2017-09-27",543,535]
[null,"2017-09-28",651,641]
[null,"2017-09-29",528,522]
[null,"2017-09-30",156,151]
[null,"2017-10-01",91,90]
[null,"2017-10-02",125,125]
[null,"2017-10-03",576,567]
[null,"2017-10-04",627,622]
[null,"2017-10-05",667,654]
[null,"2017-10-06",514,505]
[null,"2017-10-07",139,138]
[null,"2017-10-08",106,103]
[null,"2017-10-09",660,652]
[null,"2017-10-10",598,593]
[null,"2017-10-11",756,734]
[null,"2017-10-12",742,735]
[null,"2017-10-13",532,530]
[null,"2017-10-14",152,151]
[null,"2017-10-15",127,124]
[null,"2017-10-16",696,690]
[null,"2017-10-17",639,630]
[null,"2017-10-18",625,619]
[null,"2017-10-19",582,576]
[null,"2017-10-20",797,785]
[null,"2017-10-21",163,163]
[null,"2017-10-22",135,132]
[null,"2017-10-23",623,613]
[null,"2017-10-24",617,606]
[null,"2017-10-25",574,570]
[null,"2017-10-26",552,545]
[null,"2017-10-27",686,667]
[null,"2017-10-28",175,167]
[null,"2017-10-29",107,106]
[null,"2017-10-30",808,792]
[null,"2017-10-31",628,619]
[null,"2017-11-01",603,601]
[null,"2017-11-02",574,570]
[null,"2017-11-03",553,547]
[null,"2017-11-04",198,195]
[null,"2017-11-05",174,170]
[null,"2017-11-06",769,753]
[null,{"$f":"B143+1","v":"2017-11-07"},559,552]
[null,"2017-11-08",572,562]
[null,"2017-11-09",635,623]
[null,"2017-11-10",559,551]
[null,"2017-11-11",231,227]
[null,"2017-11-12",120,120]
[null,"2017-11-13",647,633]
[null,"2017-11-14",577,569]
[null,"2017-11-15",631,622]
[null,"2017-11-16",575,567]
[null,"2017-11-17",720,710]
[null,"2017-11-18",227,227]
[null,"2017-11-19",119,119]
[null,"2017-11-20",613,601]
[null,"2017-11-21",618,608]
[null,"2017-11-22",662,650]
[null,"2017-11-23",641,630]
[null,"2017-11-24",601,576]
[null,"2017-11-25",264,253]
[null,"2017-11-26",190,187]
[null,"2017-11-27",631,628]
[null,"2017-11-28",565,563]
[null,"2017-11-29",547,542]
[null,"2017-11-30",708,701]
[null,"2017-12-01",527,523]
[null,"2017-12-02",435,419]
[null,"2017-12-03",127,126]
[null,"2017-12-04",570,561]
[null,"2017-12-05",565,560]
[null,"2017-12-06",635,626]
[null,"2017-12-07",785,768]
[null,"2017-12-08",578,566]
[null,"2017-12-09",198,197]
[null,"2017-12-10",96,96]
[null,"2017-12-11",638,631]
[null,"2017-12-12",528,520]
[null,"2017-12-13",646,640]
[null,"2017-12-14",1033,1009]
[null,"2017-12-15",668,656]
[null,"2017-12-16",362,351]
[null,"2017-12-17",404,392]
[null,"2017-12-18",701,696]
[null,"2017-12-19",871,854]
[null,"2017-12-20",1075,1038]
[null,"2017-12-21",558,554]
[null,"2017-12-22",414,404]
[null,"2017-12-23",289,279]
[null,"2017-12-24",210,205]
[null,"2017-12-25",81,81]
[null,"2017-12-26",96,96]
[null,"2017-12-27",299,294]
[null,"2017-12-28",281,280]
[null,"2017-12-29",286,285]
[null,"2017-12-30",232,230]
[null,"2017-12-31",131,128]
[null,"2018-01-01",127,126]
[null,"2018-01-02",417,412]
[null,"2018-01-03",459,456]
[null,"2018-01-04",526,520]
[null,"2018-01-05",405,402]
[null,"2018-01-06",219,213]
[null,"2018-01-07",625,580]
[null,"2018-01-08",919,892]
[null,"2018-01-09",1365,1303]
[null,{"$f":"B207+1","v":"2018-01-10"},708,703]
[null,"2018-01-11",711,702]
[null,"2018-01-12",651,645]
[null,"2018-01-13",462,456]
[null,"2018-01-14",248,247]
[null,"2018-01-15",806,794]
[null,"2018-01-16",573,562]
[null,"2018-01-17",744,732]
[null,"2018-01-18",620,607]
[null,"2018-01-19",788,775]
[null,"2018-01-20",233,229]
[null,"2018-01-21",189,181]
[null,"2018-01-22",813,793]
[null,"2018-01-23",764,752]
[null,"2018-01-24",645,634]
[null,"2018-01-25",599,585]
[null,"2018-01-26",278,272]
[null,"2018-01-27",253,246]
[null,"2018-01-28",271,270]
[null,"2018-01-29",685,679]
[null,"2018-01-30",698,683]
[null,"2018-01-31",645,638]
[null,"2018-02-01",629,622]
[null,"2018-02-02",633,624]
[null,"2018-02-03",328,322]
[null,"2018-02-04",152,151]
[null,"2018-02-05",717,710]
[null,"2018-02-06",627,623]
[null,"2018-02-07",650,637]
[null,"2018-02-08",639,631]
[null,"2018-02-09",832,803]
[null,"2018-02-10",424,416]
[null,"2018-02-11",209,206]
[null,"2018-02-12",715,708]
[null,"2018-02-13",600,589]
[null,"2018-02-14",928,903]
[null,"2018-02-15",686,676]
[null,"2018-02-16",636,625]
[null,"2018-02-17",562,531]
[null,"2018-02-18",176,175]
[null,"2018-02-19",772,762]
[null,"2018-02-20",857,843]
[null,"2018-02-21",675,665]
[null,"2018-02-22",814,799]
[null,"2018-02-23",660,641]
[null,"2018-02-24",322,315]
[null,"2018-02-25",278,271]
[null,"2018-02-26",812,793]
[null,"2018-02-27",686,677]
[null,"2018-02-28",657,643]
[null,"2018-03-01",564,557]
[null,"2018-03-02",574,565]
[null,"2018-03-03",193,191]
[null,"2018-03-04",151,150]
[null,"2018-03-05",653,642]
[null,"2018-03-06",664,643]
[null,"2018-03-07",612,598]
[null,"2018-03-08",583,571]
[null,"2018-03-09",534,528]
[null,"2018-03-10",224,223]
[null,"2018-03-11",123,123]
[null,"2018-03-12",689,673]
[null,"2018-03-13",706,685]
[null,"2018-03-14",670,656]
[null,{"$f":"B271+1","v":"2018-03-15"},695,685]
[null,"2018-03-16",623,607]
[null,"2018-03-17",184,183]
[null,"2018-03-18",586,556]
[null,"2018-03-19",980,958]
[null,"2018-03-20",732,718]
[null,"2018-03-21",727,721]
[null,"2018-03-22",754,738]
[null,"2018-03-23",491,486]
[null,"2018-03-24",232,232]
[null,"2018-03-25",222,219]
[null,"2018-03-26",733,722]
[null,"2018-03-27",720,707]
[null,"2018-03-28",616,610]
[null,"2018-03-29",608,602]
[null,"2018-03-30",144,141]
[null,"2018-03-31",166,164]
[null,"2018-04-01",165,162]
[null,"2018-04-02",159,159]
[null,"2018-04-03",530,528]
[null,"2018-04-04",650,641]
[null,"2018-04-05",506,496]
[null,"2018-04-06",541,535]
[null,"2018-04-07",188,187]
[null,"2018-04-08",125,125]
[null,"2018-04-09",769,747]
[null,"2018-04-10",585,577]
[null,"2018-04-11",624,611]
[null,"2018-04-12",735,724]
[null,"2018-04-13",590,584]
[null,"2018-04-14",572,550]
[null,"2018-04-15",592,573]
[null,"2018-04-16",785,772]
[null,"2018-04-17",600,595]
[null,"2018-04-18",565,562]
[null,"2018-04-19",629,625]
[null,"2018-04-20",578,572]
[null,"2018-04-21",195,188]
[null,"2018-04-22",94,94]
[null,"2018-04-23",699,687]
[null,"2018-04-24",616,612]
[null,"2018-04-25",99,98]
[null,"2018-04-26",528,524]
[null,"2018-04-27",612,606]
[null,"2018-04-28",434,414]
[null,"2018-04-29",213,209]
[null,"2018-04-30",630,623]
[null,"2018-05-01",698,684]
[null,"2018-05-02",646,635]
[null,"2018-05-03",628,623]
[null,"2018-05-04",582,579]
[null,"2018-05-05",219,219]
[null,"2018-05-06",113,111]
[null,"2018-05-07",615,605]
[null,"2018-05-08",647,642]
[null,"2018-05-09",586,579]
[null,"2018-05-10",673,664]
[null,"2018-05-11",574,567]
[null,"2018-05-12",258,251]
[null,"2018-05-13",140,139]
[null,"2018-05-14",711,707]
[null,"2018-05-15",684,676]
[null,"2018-05-16",582,581]
[null,"2018-05-17",730,719]
[null,{"$f":"B335+1","v":"2018-05-18"},572,570]
[null,"2018-05-19",276,270]
[null,"2018-05-20",145,142]
[null,"2018-05-21",613,606]
[null,"2018-05-22",678,664]
[null,"2018-05-23",595,590]
[null,"2018-05-24",673,660]
[null,"2018-05-25",621,617]
[null,"2018-05-26",173,170]
[null,"2018-05-27",159,158]
[null,"2018-05-28",598,594]
[null,"2018-05-29",637,634]
[null,"2018-05-30",623,618]
[null,"2018-05-31",644,636]
[null,"2018-06-01",531,526]
[null,"2018-06-02",231,226]
[null,"2018-06-03",198,194]
[null,"2018-06-04",560,556]
[null,"2018-06-05",604,598]
[null,"2018-06-06",699,688]
[null,"2018-06-07",590,580]
[null,"2018-06-08",587,582]
[null,"2018-06-09",228,226]
[null,"2018-06-10",174,170]
[null,"2018-06-11",175,174]
[null,"2018-06-12",671,658]
[null,"2018-06-13",539,532]
[null,"2018-06-14",566,562]
[null,"2018-06-15",772,756]
[null,"2018-06-16",466,445]
[null,"2018-06-17",212,209]
[null,"2018-06-18",611,606]
[null,"2018-06-19",687,685]
[null,"2018-06-20",675,670]
[null,"2018-06-21",647,643]
[null,"2018-06-22",537,533]
[null,"2018-06-23",243,241]
[null,"2018-06-24",170,165]
[null,"2018-06-25",765,763]
[null,"2018-06-26",630,624]
[null,"2018-06-27",735,723]
[null,"2018-06-28",682,675]
[null,"2018-06-29",537,532]
[null,"2018-06-30",194,193]
[null,"2018-07-01"]

{"sheet":"6.8 STPIS Exclusions","index":13,"n_rows":403,"n_cols":12,"rows_kept":403,"cut":false,"hidden":false,"merged":[[9,11,10,11],[6,1,6,4],[9,6,9,8],[9,5,10,5],[9,4,10,4],[9,2,10,2],[9,3,10,3]]}
[null,{"$f":"IF(dms_DataQuality=\"backcast\",INDEX(dms_Worksheet_List,MATCH(dms_Model,dms_Model_List))&\" BACKCAST\",INDEX(dms_Worksheet_List,MATCH(dms_Model,dms_Model_List)))","v":"ANNUAL REPORTING STATEMENT"}]
[null,{"$f":"INDEX(dms_TradingNameFull_List,MATCH(dms_TradingName,dms_TradingName_List))","v":"Endeavour Energy"}]
[null,{"$f":"CONCATENATE(\"Annual Reporting RIN Response \",IF(SUM(dms_SingleYear_Model)>0,CONCATENATE(CRY),CONCATENATE(FRCP_y1,\" to \",dms_MultiYear_FinalYear_Result)))","v":"Annual Reporting RIN Response 2017-18"}]
[null,"6.8 STPIS EXCLUSIONS"]
[]
[]
[null,"This information is collected to inform the application of the STPIS to Australian Distribution Co. in future regulatory periods. The information is also collected to monitor network performance, and may be used in performance reports."]
[]
[null,"6.8.1 - STPIS EXCLUSIONS"]
[null,"Date of event","Outage ID","Feeder ID / name","Feeder classification\n(drop down)","Cause of event\n(drop down)","Unplanned",null,null,"Event category","Effect on unplanned MAIFI","Please provide separate explanation to confirm the outage was not due to inadequate transmission connection planning "]
[null,"DD/MM/YYYY",null,null,null,null,"Number of  interruptions","Duration of interruption\n(mins)","Total unplanned minutes off supply","Use exclusion categories listed in section 3.3(a) of the STPIS\n(drop down)","by feeder classification"]
[]
[]
[]
[]
[]
[]
[]
[]
[]
[]
[]
[]
[]
[]
[]
[]
[]
[]
[]
[]
[]
[]
[]
[]
[]
[]
[]
[]
[]
[]
[]
[]
[]
[]
[]
[]
[]
[]
[]
[]
[]
[]
[]
[]
[]
[]
[]
[]
[]
[]
[]
[]
[]
[]
[]
[]
[]
[]
[]
[]
[]
[]
[]
[]
[]
[]
[]
[]
[]
[]
[]
[]
[]
[]
[]
[]
[]
[]
[]
[]
[]
[]
[]
[]
[]
[]
[]
[]
[]
[]
[]
[]
[]
[]
[]
[]
[]
[]
[]
[]
[]
[]
[]
[]
[]
[]
[]
[]
[]
[]
[]
[]
[]
[]
[]
[]
[]
[]
[]
[]
[]
[]
[]
[]
[]
[]
[]
[]
[]
[]
[]
[]
[]
[]
[]
[]
[]
[]
[]
[]
[]
[]
[]
[]
[]
[]
[]
[]
[]
[]
[]
[]
[]
[]
[]
[]
[]
[]
[]
[]
[]
[]
[]
[]
[]
[]
[]
[]
[]
[]
[]
[]
[]
[]
[]
[]
[]
[]
[]
[]
[]
[]
[]
[]
[]
[]
[]
[]
[]
[]
[]
[]
[]
[]
[]
[]
[]
[]
[]
[]
[]
[]
[]
[]
[]
[]
[]
[]
[]
[]
[]
[]
[]
[]
[]
[]
[]
[]
[]
[]
[]
[]
[]
[]
[]
[]
[]
[]
[]
[]
[]
[]
[]
[]
[]
[]
[]
[]
[]
[]
[]
[]
[]
[]
[]
[]
[]
[]
[]
[]
[]
[]
[]
[]
[]
[]
[]
[]
[]
[]
[]
[]
[]
[]
[]
[]
[]
[]
[]
[]
[]
[]
[]
[]
[]
[]
[]
[]
[]
[]
[]
[]
[]
[]
[]
[]
[]
[]
[]
[]
[]
[]
[]
[]
[]
[]
[]
[]
[]
[]
[]
[]
[]
[]
[]
[]
[]
[]
[]
[]
[]
[]
[]
[]
[]
[]
[]
[]
[]
[]
[]
[]
[]
[]
[]
[]
[]
[]
[]
[]
[]
[]
[]
[]
[]
[]
[]
[]
[]
[]
[]
[]
[]
[]
[]
[]
[]
[]
[]
[]
[]
[]
[]
[]
[]
[]
[]
[]
[]
[]
[]
[]
[]
[]
[]
[]
[]
[]
[]
[]
[]
[]
[]
[]
[]
[]
[]
[]
[]
[]
[]
[]
[]
[]
[]
[]
[]
[]
[]
[]
[]
[null,"To enter further events - please insert new lines above this line. "]

{"sheet":"6.9 STPIS - GSL","index":14,"n_rows":110,"n_cols":5,"rows_kept":110,"cut":false,"hidden":false,"merged":[[71,1,71,2],[59,1,59,2],[60,1,60,2],[61,1,61,2],[67,1,67,2],[66,1,66,2],[65,1,65,2],[17,1,17,2],[15,1,15,2],[5,1,5,2],[7,1,7,2],[14,1,14,2],[16,1,16,2],[21,1,21,2],[23,1,23,2],[24,1,24,2],[25,1,25,2],[22,1,22,2],[29,1,29,2],[33,1,33,2],[34,1,34,2],[30,1,30,2],[31,1,31,2],[32,1,32,2],[35,1,35,2],[36,1,36,2],[37,1,37,2],[38,1,38,2],[39,1,39,2],[43,1,43,2],[45,1,45,2],[46,1,46,2],[47,1,47,2],[44,1,44,2],[93,1,93,2],[94,1,94,2],[48,1,48,2],[49,1,49,2],[79,1,79,2],[78,1,78,2],[85,1,85,2],[53,1,53,2],[54,1,54,2],[55,1,55,2],[58,1,58,4],[64,1,64,4],[70,1,70,4],[76,1,76,4],[73,1,73,2],[72,1,72,2],[5,4,5,5],[109,1,109,2],[77,1,77,2],[106,1,106,2],[108,1,108,2],[101,1,101,2],[102,1,102,2],[103,1,103,2],[104,1,104,2],[96,1,96,2],[97,1,97,2],[98,1,98,2],[99,1,99,2],[100,1,100,2],[91,1,91,2],[92,1,92,2]]}
[null,{"$f":"IF(dms_DataQuality=\"backcast\",INDEX(dms_Worksheet_List,MATCH(dms_Model,dms_Model_List))&\" BACKCAST\",INDEX(dms_Worksheet_List,MATCH(dms_Model,dms_Model_List)))","v":"ANNUAL REPORTING STATEMENT"}]
[null,{"$f":"INDEX(dms_TradingNameFull_List,MATCH(dms_TradingName,dms_TradingName_List))","v":"Endeavour Energy"}]
[null,{"$f":"CONCATENATE(\"Annual Reporting RIN Response \",IF(SUM(dms_SingleYear_Model)>0,CONCATENATE(CRY),CONCATENATE(FRCP_y1,\" to \",dms_MultiYear_FinalYear_Result)))","v":"Annual Reporting RIN Response 2017-18"}]
[null,"6.9 STPIS - GUARANTEED SERVICE LEVEL"]
[]
[null,"Did the AER's GSL Scheme apply at any time during the regulatory year?",null,"No","**IMPORTANT \nPlease ensure this flag is set. Conditional formatting on this worksheet is dependant on this response."]
[]
[null,"Instructions:\nTable 6.9.1 collects information relating to jurisdiction GSL scheme parameters. These parameters can be found in the jurisdictonal scheme relevant to NSP. Please identify each parameter in the relevant sub-tables and provide the volume and value of GSL payments. \n\nFor GSL parameters that do not fit within the provided sub-tables provided, please enter a heading and identify the relevant parameter(s). "]
[]
[null,"6.9.1 - GUARANTEED SERVICE LEVELS - JURISDICTIONAL GSL SCHEME"]
[null,null,null,{"$f":"CRY","v":"2017-18"},{"$f":"CRY","v":"2017-18"}]
[null,null,null,"Volume","Value of GSL payments"]
[null,null,null,"0's","$0's"]
[null,"Appointments"]
[null,"Nil"]
[]
[]
[]
[null,"To enter further GSL parameters relating to appointments - please copy a row from above and \"insert copied cells\" above this row."]
[]
[null,"Connections"]
[null,"Nil"]
[]
[]
[]
[]
[null,"To enter further GSL parameters relating to connections -  please copy a row from above and \"insert copied cells\" above this row."]
[]
[null,"Reliability of supply"]
[null,"Nil"]
[]
[]
[]
[]
[]
[]
[]
[]
[]
[]
[null,"To enter further GSL parameters relating to reliability of supply -  please copy a row from above and \"insert copied cells\" above this row."]
[]
[null,"Street lights"]
[null,"Street lights \"out\" during period",null,14323,0]
[null,"Street lights not repaired by \"fix by\" date",null,1512,0]
[null,"Street lights not repaired in 2 business days",null,1512,0]
[null,"Street lights - number os business days to repair",null,4.8,0]
[null,"Street lights -GSL payments",null,327,4905]
[]
[]
[null,"To enter further GSL parameters relating to street lights -  please copy a row from above and \"insert copied cells\" above this row."]
[]
[null,"Planned interruptions"]
[null,"Nil"]
[]
[]
[null,"To enter further GSL parameters relating to planned interruptions -  please copy a row from above and \"insert copied cells\" above this row."]
[]
[null,"<NSP defined parameter category>"]
[]
[]
[]
[null,"To enter further GSL parameters - please identify the parameter and if insufficient rows  please copy a row from above and \"insert copied cells\" above this row."]
[]
[null,"<NSP defined parameter category>"]
[]
[]
[]
[null,"To enter further GSL parameters - please identify the parameter and if insufficient rows  please copy a row from above and \"insert copied cells\" above this row."]
[]
[null,"<NSP defined parameter category>"]
[]
[]
[]
[null,"To enter further GSL parameters - please identify the parameter and if insufficient rows  please copy a row from above and \"insert copied cells\" above this row."]
[]
[null,"<NSP defined parameter category>"]
[]
[]
[]
[null,"To enter further GSL parameters - please identify the parameter and if insufficient rows  please copy a row from above and \"insert copied cells\" above this row."]
[]
[]
[null,"6.9.2 - GUARANTEED SERVICE LEVELS - AER GSL SCHEME"]
[]
[null,"Complete Table 6.9.2 if the AER's GSL scheme applied at any time during the regulatory year. \n\nDo not complete Table 6.9.2 if the AER's GSL scheme did not apply during the regulatory year."]
[]
[null,null,null,{"$f":"CRY","v":"2017-18"},{"$f":"CRY","v":"2017-18"}]
[null,null,null,"Volume","Value \nof GSL payments"]
[null,null,null,"0's","$0's"]
[null,"New connections "]
[null,"Number of connections made"]
[null,"Number of connections not made on or before the day agreed"]
[null,"Connections - GSL payments – 1-6 day delay"]
[null,"Connections - GSL payments – 7+ day delay"]
[null,"Reliability of supply"]
[null,"Frequency of interruptions – CBD feeders – 9 interruptions"]
[null,"Frequency of interruptions – Urban feeders – 9 interruptions"]
[null,"Frequency of interruptions – Rural (short and long) feeders – 15 interruptions"]
[null,"Interruptions – CBD feeders – 12 hours duration"]
[null,"Interruptions – Urban feeders – 12 hours duration"]
[null,"Interruptions – Rural (short and long) feeders – 18 hours duration"]
[null,"Total duration of interruptions Level 1 – 20 hours"]
[null,"Total duration of interruptions Level 2 – 30 hours"]
[null,"Total duration of interruptions Level 3 – 60 hours"]
[null,"Street lights"]
[null,"Streetlight repair 5 days – GSL payments"]
[null,"Planned interruptions"]
[null,"Notice of planned interruptions – 4 business days notice not given"]
[null,"Total ",null,null,{"$f":"SUM(E109,E107,E97:E105,E94:E95)","v":0}]

{"sheet":"7.8 Avoided TUOS Payments","index":15,"n_rows":11,"n_cols":3,"rows_kept":11,"cut":false,"hidden":false,"merged":[]}
[null,{"$f":"IF(dms_DataQuality=\"backcast\",INDEX(dms_Worksheet_List,MATCH(dms_Model,dms_Model_List))&\" BACKCAST\",INDEX(dms_Worksheet_List,MATCH(dms_Model,dms_Model_List)))","v":"ANNUAL REPORTING STATEMENT"}]
[null,{"$f":"INDEX(dms_TradingNameFull_List,MATCH(dms_TradingName,dms_TradingName_List))","v":"Endeavour Energy"}]
[null,{"$f":"CONCATENATE(\"Annual Reporting RIN Response \",IF(SUM(dms_SingleYear_Model)>0,CONCATENATE(CRY),CONCATENATE(FRCP_y1,\" to \",dms_MultiYear_FinalYear_Result)))","v":"Annual Reporting RIN Response 2017-18"}]
[null,"7.8 - AVOIDED TUOS PAYMENTS"]
[]
[null,"7.8.1 - AVOIDED TUOS PAYMENTS"]
[null,null,"Avoided TUOS Payment "]
[null,null,"$0's, nominal"]
[null,"Embedded generators",1268223.33]
[null,"Market network service providers",0]
[null,"Other",0]

{"sheet":"7.10 Juris Scheme","index":16,"n_rows":17,"n_cols":6,"rows_kept":17,"cut":false,"hidden":false,"merged":[[8,4,9,4],[8,3,9,3],[8,2,9,2],[8,1,9,1],[5,1,5,2]]}
[null,{"$f":"IF(dms_DataQuality=\"backcast\",INDEX(dms_Worksheet_List,MATCH(dms_Model,dms_Model_List))&\" BACKCAST\",INDEX(dms_Worksheet_List,MATCH(dms_Model,dms_Model_List)))","v":"ANNUAL REPORTING STATEMENT"}]
[null,{"$f":"INDEX(dms_TradingNameFull_List,MATCH(dms_TradingName,dms_TradingName_List))","v":"Endeavour Energy"}]
[null,{"$f":"CONCATENATE(\"Annual Reporting RIN Response \",IF(SUM(dms_SingleYear_Model)>0,CONCATENATE(CRY),CONCATENATE(FRCP_y1,\" to \",dms_MultiYear_FinalYear_Result)))","v":"Annual Reporting RIN Response 2017-18"}]
[null,"7.10 - JURISDICTIONAL SCHEMES"]
[]
[null,"Instructions\nBusiness must list each relevant jurisdictional scheme individually and report information for each scheme separately from other schemes."]
[]
[null,"7.10.1 - JURISDICTIONAL SCHEME PAYMENTS"]
[null,"Jurisdictional Scheme Name","Description","Date DNSP Became Subject to Scheme","Description of Cost Recovery Method","Total Scheme Payments  "]
[null,null,null,null,null,"$0's, nominal"]
[null,"Solar Bonus Scheme (established under the Electricity Supply Act 1995 (NSW)) - [Rule 6.18.7A(e)(2)]"," The NSW Government’s Solar Bonus Scheme (SBS) credits participating customers with a feed in tariff for all the electricity that their eligible solar photovoltaic (PV) system or wind turbine generates and provides to the network.","The SBS commenced 1 January 2010. ","Not applicable. The SBS closed 31 December 2016",0]
[null,"Climate Change Fund (established under the Energy and Utilities Administration Act 1987 (NSW)) - [Rule 6.18.7A(e)(3)].","The NSW Government's Climate Change Fund (CCF) was established to address the impacts of climate change, encourage energy and water saving activities and increase public awareness and acceptance of climate change.","The CCF commenced 1 July 2007","Costs are recovered in accordance with 6.18.7A of the Rules.  The NSW Government requires Endeavour Energy to recover no more than 25% of CCF payments from Residential customers. ",88185379]
[]
[]
[]
[]
[null,null,null,null,"Total",{"$f":"SUM(F11:F16)","v":88185379}]

{"sheet":"7.11 DMIS-DMIA","index":17,"n_rows":46,"n_cols":5,"rows_kept":46,"cut":false,"hidden":false,"merged":[[6,2,6,4],[8,2,8,4]]}
[null,{"$f":"IF(dms_DataQuality=\"backcast\",INDEX(dms_Worksheet_List,MATCH(dms_Model,dms_Model_List))&\" BACKCAST\",INDEX(dms_Worksheet_List,MATCH(dms_Model,dms_Model_List)))","v":"ANNUAL REPORTING STATEMENT"}]
[null,{"$f":"INDEX(dms_TradingNameFull_List,MATCH(dms_TradingName,dms_TradingName_List))","v":"Endeavour Energy"}]
[null,{"$f":"CONCATENATE(\"Annual Reporting RIN Response \",IF(SUM(dms_SingleYear_Model)>0,CONCATENATE(CRY),CONCATENATE(FRCP_y1,\" to \",dms_MultiYear_FinalYear_Result)))","v":"Annual Reporting RIN Response 2017-18"}]
[null,"7.11 - DEMAND MANAGEMENT INCENTIVE SCHEME"]
[]
[null,"7.11.1 - DMIA - PROJECTS SUBMITTED FOR APPROVAL"]
[null,null,{"$f":"CONCATENATE(\"Total amount of the DMIA spent in \", CRY)","v":"Total amount of the DMIA spent in 2017-18"}]
[null,null,"Operating expenditure","Capital expenditure","Total"]
[null,"Name of project","$0's, nominal"]
[null,"Residential Battery Energy Storage Trial",464551,0,{"$f":"SUM(C10:D10)","v":464551}]
[null,"Air Conditioner Control Trial using 3G DRED",228864,69218,298082]
[null,"Grid Connected Battery Energy Storage System",0,114816,114816]
[null,null,null,null,0]
[null,null,null,null,0]
[null,null,null,null,0]
[null,null,null,null,{"$f":"SUM(C16:D16)","v":0}]
[null,null,null,null,0]
[null,null,null,null,0]
[null,null,null,null,0]
[null,null,null,null,0]
[null,null,null,null,0]
[null,null,null,null,0]
[null,null,null,null,0]
[null,null,null,null,0]
[null,null,null,null,0]
[null,null,null,null,0]
[null,null,null,null,0]
[null,null,null,null,0]
[null,null,null,null,0]
[null,null,null,null,0]
[null,null,null,null,0]
[null,null,null,null,0]
[null,null,null,null,0]
[null,null,null,null,0]
[null,null,null,null,0]
[null,null,null,null,0]
[null,null,null,null,0]
[null,null,null,null,0]
[null,null,null,null,0]
[null,null,null,null,0]
[null,null,null,null,0]
[null,null,null,null,0]
[null,null,null,null,0]
[null,null,null,null,0]
[null,"To enter additional projects - please copy an existing row and insert above this row. "]
[null,"Total",{"$f":"SUM(C10:C45)","v":693415},{"$f":"SUM(D10:D45)","v":184034},{"$f":"SUM(E10:E45)","v":877449}]

{"sheet":"7.12 Safety and Bushfire","index":18,"n_rows":339,"n_cols":7,"rows_kept":339,"cut":false,"hidden":false,"merged":[[137,1,137,2],[138,1,138,2],[296,6,296,7],[297,6,297,7],[84,3,84,4],[85,3,85,4],[163,2,163,3],[164,2,164,3],[213,3,213,4],[214,3,214,4],[139,1,139,2],[140,1,140,2],[141,1,141,2],[142,1,142,2],[143,1,143,2],[144,1,144,2],[145,1,145,2],[117,1,118,2],[212,1,214,1],[212,2,214,2],[162,1,164,1],[128,1,128,2],[129,1,129,2],[130,1,130,2],[131,1,131,2],[132,1,132,2],[133,1,133,2],[134,1,134,2],[135,1,135,2],[136,1,136,2],[119,1,119,2],[120,1,120,2],[121,1,121,2],[122,1,122,2],[123,1,123,2],[124,1,124,2],[125,1,125,2],[126,1,126,2],[127,1,127,2],[41,6,41,8],[38,6,38,8],[39,6,39,8],[279,6,279,7],[280,6,280,7],[303,6,303,7],[304,6,304,7],[287,6,287,7],[288,6,288,7],[289,6,289,7],[290,6,290,7],[291,6,291,7],[292,6,292,7],[293,6,293,7],[294,6,294,7],[295,6,295,7],[298,6,298,7],[299,6,299,7],[300,6,300,7],[301,6,301,7],[302,6,302,7],[281,6,281,7],[282,6,282,7],[283,6,283,7],[29,6,29,8],[30,6,30,8],[31,6,31,8],[23,6,23,8],[24,6,24,8],[25,6,25,8],[26,6,26,8],[27,6,27,8],[40,6,40,8],[37,6,37,8],[5,1,5,2],[25,2,25,5],[26,2,26,5],[27,2,27,5],[28,2,28,5],[29,2,29,5],[30,2,30,5],[42,2,42,5],[31,2,31,5],[32,2,32,5],[14,1,14,4],[13,1,13,4],[33,2,33,5],[24,2,24,5],[17,2,17,5],[18,2,18,5],[19,2,19,5],[20,2,20,5],[21,2,21,5],[22,2,22,5],[23,2,23,5],[10,1,10,2],[41,2,41,5],[38,2,38,5],[83,1,85,1],[83,2,85,2],[11,1,11,2],[17,6,17,8],[32,6,32,8],[33,6,33,8],[34,2,34,5],[34,6,34,8],[35,2,35,5],[35,6,35,8],[36,2,36,5],[36,6,36,8],[43,2,43,5],[37,2,37,5],[18,6,18,8],[19,6,19,8],[20,6,20,8],[21,6,21,8],[22,6,22,8],[42,6,42,8],[43,6,43,8],[44,6,44,8],[28,6,28,8],[40,2,40,5],[326,4,326,6],[327,4,327,6],[246,1,247,1],[246,2,247,2],[311,4,311,6],[310,4,310,6],[284,6,284,7],[285,6,285,7],[286,6,286,7],[305,6,305,7],[306,6,306,7],[318,4,318,6],[319,4,319,6],[39,2,39,5],[44,2,44,5],[336,4,336,6],[337,4,337,6],[323,4,323,6],[312,4,312,6],[313,4,313,6],[314,4,314,6],[315,4,315,6],[316,4,316,6],[317,4,317,6],[324,4,324,6],[325,4,325,6],[320,4,320,6],[321,4,321,6],[322,4,322,6],[331,4,331,6],[332,4,332,6],[333,4,333,6],[335,4,335,6],[330,4,330,6],[334,4,334,6],[328,4,328,6],[329,4,329,6]]}
[null,{"$f":"IF(dms_DataQuality=\"backcast\",INDEX(dms_Worksheet_List,MATCH(dms_Model,dms_Model_List))&\" BACKCAST\",INDEX(dms_Worksheet_List,MATCH(dms_Model,dms_Model_List)))","v":"ANNUAL REPORTING STATEMENT"}]
[null,{"$f":"INDEX(dms_TradingNameFull_List,MATCH(dms_TradingName,dms_TradingName_List))","v":"Endeavour Energy"}]
[null,{"$f":"CONCATENATE(\"Annual Reporting RIN Response \",IF(SUM(dms_SingleYear_Model)>0,CONCATENATE(CRY),CONCATENATE(FRCP_y1,\" to \",dms_MultiYear_FinalYear_Result)))","v":"Annual Reporting RIN Response 2017-18"}]
[null,"7.12 SAFETY AND BUSHFIRE RELATED EXPENDITURE"]
[]
[null,"These templates collect information from Victorian businesses only.\n\nBushfire and safety related expenditure information is used by the AER to monitor the expenditures throughout the regulatory control period."]
[]
[null,"CPI applied to convert expected expenditure in real $ to nominal based on lagged September CPI index"]
[]
[null,"Instructions"]
[null,"For \"Exclusive of Margins & Overheads\" reported expenditure is to EXCLUDE any overheads, profit margins or management fees paid directly or indirectly to related party contractors (not including actual incurred expense of the related party contractor) for the reporting period."]
[null,"For \"Value of Margins & Overheads\" reported expenditure is to COMPRISE ONLY the sum of overheads, profit margins or management fees paid directly or indirectly to related party contractors (not including actual incurred expenses of the related party contractor) for the reporting period. "]
[]
[null,"Australian Distribution Co. is to specify each activity in this table in accordance with the definition in Appendix F of the RIN."]
[null,"All activities must be reported but the Reason for Difference is only required if there is a 10 per cent difference between the expected value and the actual value.\n\nUse median unit costs. Where unit costs are not recorded at the asset category level - provide the best estimates of the unit cost using the cost allocation method identified in this table. (As a transitional measure, the unit cost may be based on a statistically significant annual sample of actual work orders at a 5% or better confidence interval.)\n\nProvide basis of allocation where applicable."]
[]
[null,"7.12.1 - SAFETY AND BUSHFIRE RELATED ASSET GROUP DEFINITIONS AND ALLOCATION BASIS"]
[null,"Activity","Definitions",null,null,null,"Basis for allocation of cost to activity"]
[null,"Planned non-preferred services replacements"]
[null,"Planned replacement of non-preferred services due to height "]
[null,"Removal of public lighting switchwire "]
[null,"Replacement of existing SWER lines with 22kV overhead bare conductor "]
[null,"Installation of GFN and associated equipment at zone substations "]
[null,"Replacement of crossarms/insulator sets – pole top fire mitigation"]
[null,"Replacement of crossarms – based on age and condition "]
[null,"Replacement of poles – based on age and condition "]
[null,"Stake poles – based on age and condition "]
[null,"Replacement of undersized poles "]
[null,"Stake undersized poles"]
[null,"Replacement of overhead conductor – mainly steel "]
[null,"Service line clearance – overhead services requiring relocation "]
[null,"Service line clearance – overhead services requiring undergrounding "]
[null,"Replacement of 22kV distribution feeders with ABC/underground cabling"]
[null,"Replacement of SWER with covered carbon core conductor or equivalent"]
[null,"Replacement of SWER with ABC"]
[null,"Replacement of SWER with underground"]
[null,"Replacement of surge diverters (neptune configuration)"]
[null,"Replacement of surge diverters (single phase or three phase)"]
[]
[]
[]
[]
[]
[]
[]
[null,"To enter further activities - please copy row from above and \"insert copied cells\" into a row above this row. "]
[]
[]
[null,"7.12.2 - BUSHFIRE RELATED"]
[]
[null,"7.12.2.1 - NUMBER OF ACTIVITIES"]
[null,"Activity","Units","Number of Activities"]
[null,"Planned non-preferred services replacements","number of services"]
[null,"Planned replacement of non-preferred services due to height ","number of services"]
[null,"Removal of public lighting switchwire ","number of spans removed"]
[null,"Replacement of existing SWER lines with 22kV overhead bare conductor ","kms of SWER"]
[null,"Installation of GFN and associated equipment at zone substations ","number of zone substations"]
[null,"Replacement of crossarms/insulator sets – pole top fire mitigation","number of crossarms/sets"]
[null,"Replacement of crossarms – based on age and condition ","number of crossarms"]
[null,"Replacement of poles – based on age and condition ","number of poles"]
[null,"Stake poles – based on age and condition ","number of poles"]
[null,"Replacement of undersized poles ","number of poles"]
[null,"Stake undersized poles","number of poles"]
[null,"Replacement of overhead conductor – mainly steel ","kms "]
[null,"Service line clearance – overhead services requiring relocation ","number of services"]
[null,"Service line clearance – overhead services requiring undergrounding ","number of services"]
[null,"Replacement of 22kV distribution feeders with ABC/underground cabling","number of feeders"]
[null,"Replacement of SWER with covered carbon core conductor or equivalent","kms "]
[null,"Replacement of SWER with ABC","kms "]
[null,"Replacement of SWER with underground","kms "]
[null,"Replacement of surge diverters (neptune configuration)","number of units"]
[null,"Replacement of surge diverters (single phase or three phase)","number of units"]
[null,{"$f":"IF(ISBLANK(B39),\"\",B39)","v":""}]
[null,""]
[null,""]
[null,""]
[null,""]
[null,""]
[null,""]
[null,"To enter further activities - please copy row from above and \"insert copied cells\" into a row above this row. "]
[]
[]
[null,"7.12.2.2 - EXPENDITURE "]
[null,"Activity","Units","Exclusive of \nMargins & Overheads","Value of \nMargins & Overheads"]
[null,null,null,"Actual Expenditure"]
[null,null,null,"$0's, Nominal"]
[null,"Planned non-preferred services replacements","number of services"]
[null,"Planned replacement of non-preferred services due to height ","number of services"]
[null,"Removal of public lighting switchwire ","number of spans removed"]
[null,"Replacement of existing SWER lines with 22kV overhead bare conductor ","kms of SWER"]
[null,"Installation of GFN and associated equipment at zone substations ","number of zone substations"]
[null,"Replacement of crossarms/insulator sets – pole top fire mitigation","number of crossarms/sets"]
[null,"Replacement of crossarms – based on age and condition ","number of crossarms"]
[null,"Replacement of poles – based on age and condition ","number of poles"]
[null,"Stake poles – based on age and condition ","number of poles"]
[null,"Replacement of undersized poles ","number of poles"]
[null,"Stake undersized poles","number of poles"]
[null,"Replacement of overhead conductor – mainly steel ","kms "]
[null,"Service line clearance – overhead services requiring relocation ","number of services"]
[null,"Service line clearance – overhead services requiring undergrounding ","number of services"]
[null,"Replacement of 22kV distribution feeders with ABC/underground cabling","number of feeders"]
[null,"Replacement of SWER with covered carbon core conductor or equivalent","kms "]
[null,"Replacement of SWER with ABC","kms "]
[null,"Replacement of SWER with underground","kms "]
[null,"Replacement of surge diverters (neptune configuration)","number of units"]
[null,"Replacement of surge diverters (single phase or three phase)","number of units"]
[null,{"$f":"IF(ISBLANK(B39),\"\",B39)","v":""},{"$f":"IF(ISBLANK(C73),\"\",C73)","v":""}]
[null,"",""]
[null,"",""]
[null,"",""]
[null,"",""]
[null,"",""]
[null,"",""]
[null,"To enter further activities - please copy row from above and \"insert copied cells\" into a row above this row. "]
[]
[]
[null,"7.12.2.3 - UNIT COSTS"]
[null,"Activity",null,"Actual"]
[null,null,null,"$0's, Per Unit"]
[null,"Planned non-preferred services replacements"]
[null,"Planned replacement of non-preferred services due to height "]
[null,"Removal of public lighting switchwire "]
[null,"Replacement of existing SWER lines with 22kV overhead bare conductor "]
[null,"Installation of GFN and associated equipment at zone substations "]
[null,"Replacement of crossarms/insulator sets – pole top fire mitigation"]
[null,"Replacement of crossarms – based on age and condition "]
[null,"Replacement of poles – based on age and condition "]
[null,"Stake poles – based on age and condition "]
[null,"Replacement of undersized poles "]
[null,"Stake undersized poles"]
[null,"Replacement of overhead conductor – mainly steel "]
[null,"Service line clearance – overhead services requiring relocation "]
[null,"Service line clearance – overhead services requiring undergrounding "]
[null,"Replacement of 22kV distribution feeders with ABC/underground cabling"]
[null,"Replacement of SWER with covered carbon core conductor or equivalent"]
[null,"Replacement of SWER with ABC"]
[null,"Replacement of SWER with underground"]
[null,"Replacement of surge diverters (neptune configuration)"]
[null,"Replacement of surge diverters (single phase or three phase)"]
[null,{"$f":"IF(ISBLANK(B39),\"\",B39)","v":""}]
[null,""]
[null,""]
[null,""]
[null,""]
[null,""]
[null,""]
[null,"To enter further activities - please copy row from above and \"insert copied cells\" into a row above this row. "]
[]
[]
[null,"7.12.2.4 - CONTINGENT PROJECT APPLICATIONS - VOLUMES APPROVED"]
[null,"Activity","Units","Volume approved under contingent project applications ","Actual volumes","Difference"]
[null,null,null,null,null,{"$f":"E152-D152","v":0}]
[null,null,null,null,null,0]
[null,null,null,null,null,0]
[null,null,null,null,null,0]
[null,null,null,null,null,0]
[null,null,null,null,null,0]
[null,null,null,null,null,0]
[null,null,null,null,null,0]
[null,"To enter further activities - please copy row from above and \"insert copied cells\" into a row above this row. "]
[]
[null,"7.12.2.5 - CONTINGENT PROJECT APPLICATIONS - EXPENDITURE APPROVED"]
[null,"Activity","Exclusive of \nMargins & Overheads","Value of \nMargins & Overheads"]
[null,null,"Actual Expenditure"]
[null,null,"$0's, Nominal"]
[null,{"$f":"IF(ISBLANK(B152),\"\",B152)","v":""}]
[null,{"$f":"IF(ISBLANK(B153),\"\",B153)","v":""}]
[null,""]
[null,""]
[null,""]
[null,""]
[null,""]
[null,""]
[null,"To enter further activities - please copy row from above and \"insert copied cells\" into a row above this row. "]
[]
[]
[]
[null,"7.12.3 - SAFETY RELATED"]
[]
[null,"7.12.3.1 - NUMBER OF ACTIVITIES"]
[null,"Activity","Units","Number of Activities"]
[null,"Planned non-preferred services replacements","number of services"]
[null,"Planned replacement of non-preferred services due to height ","number of services"]
[null,"Removal of public lighting switchwire ","number of spans removed"]
[null,"Replacement of existing SWER lines with 22kV overhead bare conductor ","kms of SWER"]
[null,"Installation of GFN and associated equipment at zone substations ","number of zone substations"]
[null,"Replacement of crossarms/insulator sets – pole top fire mitigation","number of crossarms/sets"]
[null,"Replacement of crossarms – based on age and condition ","number of crossarms"]
[null,"Replacement of poles – based on age and condition ","number of poles"]
[null,"Stake poles – based on age and condition ","number of poles"]
[null,"Replacement of undersized poles ","number of poles"]
[null,"Stake undersized poles","number of poles"]
[null,"Replacement of overhead conductor – mainly steel ","kms "]
[null,"Service line clearance – overhead services requiring relocation ","number of services"]
[null,"Service line clearance – overhead services requiring undergrounding ","number of services"]
[null,"Replacement of 22kV distribution feeders with ABC/underground cabling","number of feeders"]
[null,"Replacement of SWER with covered carbon core conductor or equivalent","kms "]
[null,"Replacement of SWER with ABC","kms "]
[null,"Replacement of SWER with underground","kms "]
[null,"Replacement of surge diverters (neptune configuration)","number of units"]
[null,"Replacement of surge diverters (single phase or three phase)","number of units"]
[null,{"$f":"IF(ISBLANK(B39),\"\",B39)","v":""},{"$f":"IF(ISBLANK(C73),\"\",C73)","v":""}]
[null,"",""]
[null,"",""]
[null,"",""]
[null,"",""]
[null,"",""]
[null,"",""]
[null,"To enter further activities - please copy row from above and \"insert copied cells\" into a row above this row. "]
[]
[]
[null,"7.12.3.2 - EXPENDITURE"]
[null,"Activity","Units","Exclusive of \nMargins & Overheads","Value of \nMargins & Overheads"]
[null,null,null,"Actual Expenditure"]
[null,null,null,"$0's, Nominal"]
[null,"Planned non-preferred services replacements","number of services"]
[null,"Planned replacement of non-preferred services due to height ","number of services"]
[null,"Removal of public lighting switchwire ","number of spans removed"]
[null,"Replacement of existing SWER lines with 22kV overhead bare conductor ","kms of SWER"]
[null,"Installation of GFN and associated equipment at zone substations ","number of zone substations"]
[null,"Replacement of crossarms/insulator sets – pole top fire mitigation","number of crossarms/sets"]
[null,"Replacement of crossarms – based on age and condition ","number of crossarms"]
[null,"Replacement of poles – based on age and condition ","number of poles"]
[null,"Stake poles – based on age and condition ","number of poles"]
[null,"Replacement of undersized poles ","number of poles"]
[null,"Stake undersized poles","number of poles"]
[null,"Replacement of overhead conductor – mainly steel ","kms "]
[null,"Service line clearance – overhead services requiring relocation ","number of services"]
[null,"Service line clearance – overhead services requiring undergrounding ","number of services"]
[null,"Replacement of 22kV distribution feeders with ABC/underground cabling","number of feeders"]
[null,"Replacement of SWER with covered carbon core conductor or equivalent","kms "]
[null,"Replacement of SWER with ABC","kms "]
[null,"Replacement of SWER with underground","kms "]
[null,"Replacement of surge diverters (neptune configuration)","number of units"]
[null,"Replacement of surge diverters (single phase or three phase)","number of units"]
[null,{"$f":"IF(ISBLANK(B39),\"\",B39)","v":""},{"$f":"IF(ISBLANK(C73),\"\",C73)","v":""}]
[null,"",""]
[null,"",""]
[null,"",""]
[null,"",""]
[null,"",""]
[null,"",""]
[null,"To enter further activities - please copy row from above and \"insert copied cells\" into a row above this row. "]
[]
[]
[null,"7.12.3.3 - UNIT COSTS"]
[null,"Activity","Units","Actual"]
[null,null,null,"$0's, Per Unit"]
[null,"Planned non-preferred services replacements","number of services"]
[null,"Planned replacement of non-preferred services due to height ","number of services"]
[null,"Removal of public lighting switchwire ","number of spans removed"]
[null,"Replacement of  existing SWER lines with 22kV overhead bare conductor ","kms of SWER"]
[null,"Installation of GFN and associated equipment at zone substations ","number of zone substations"]
[null,"Replacement of crossarms/insulator sets – pole top fire mitigation","number of crossarms/sets"]
[null,"Replacement of crossarms – based on age and condition ","number of crossarms"]
[null,"Replacement of poles – based on age and condition ","number of poles"]
[null,"Stake poles – based on age and condition ","number of poles"]
[null,"Replacement of undersized poles ","number of poles"]
[null,"Stake undersized poles","number of poles"]
[null,"Replacement of overhead conductor – mainly steel ","kms "]
[null,"Service line clearance – overhead services requiring relocation ","number of services"]
[null,"Service line clearance – overhead services requiring undergrounding ","number of services"]
[null,"Replacement of 22kV distribution feeders with ABC/underground cabling","number of feeders"]
[null,"Replacement of SWER with covered carbon core conductor or equivalent","kms "]
[null,"Replacement of SWER with ABC","kms "]
[null,"Replacement of SWER with underground","kms "]
[null,"Replacement of surge diverters (neptune configuration)","number of units"]
[null,"Replacement of surge diverters (single phase or three phase)","number of units"]
[null,{"$f":"IF(ISBLANK(B39),\"\",B39)","v":""},{"$f":"IF(ISBLANK(C73),\"\",C73)","v":""}]
[null,"",""]
[null,"",""]
[null,"",""]
[null,"",""]
[null,"",""]
[null,"",""]
[null,"To enter further activities - please copy row from above and \"insert copied cells\" into a row above this row. "]
[]
[]
[null,"7.12.4 - SAFETY IMPROVEMENT OUTCOMES REPORTED TO ESV"]
[null,"Activity","Units","Safety Improvement Programme - outcomes","Safety Improvement Target","Difference","Reasons for Difference"]
[null,"Planned non-preferred services replacements","number of services",null,null,{"$f":"D281-E281","v":0}]
[null,"Planned replacement of non-preferred services due to height ","number of services",null,null,{"$f":"D282-E282","v":0}]
[null,"Removal of public lighting switchwire ","number of spans removed",null,null,0]
[null,"Replacement of  existing SWER lines with 22kV overhead bare conductor ","kms of SWER",null,null,0]
[null,"Installation of GFN and associated equipment at zone substations ","number of zone substations",null,null,0]
[null,"Replacement of crossarms/insulator sets – pole top fire mitigation","number of crossarms/sets",null,null,0]
[null,"Replacement of crossarms – based on age and condition ","number of crossarms",null,null,0]
[null,"Replacement of poles – based on age and condition ","number of poles",null,null,0]
[null,"Stake poles – based on age and condition ","number of poles",null,null,0]
[null,"Replacement of undersized poles ","number of poles",null,null,0]
[null,"Stake undersized poles","number of poles",null,null,0]
[null,"Replacement of overhead conductor – mainly steel ","kms ",null,null,0]
[null,"Service line clearance – overhead services requiring relocation ","number of services",null,null,0]
[null,"Service line clearance – overhead services requiring undergrounding ","number of services",null,null,0]
[null,"Replacement of 22kV distribution feeders with ABC/underground cabling","number of feeders",null,null,0]
[null,"Replacement of SWER with covered carbon core conductor or equivalent","kms ",null,null,0]
[null,"Replacement of SWER with ABC","kms ",null,null,0]
[null,"Replacement of SWER with underground","kms ",null,null,{"$f":"D298-E298","v":0}]
[null,"Replacement of surge diverters (neptune configuration)","number of units",null,null,0]
[null,"Replacement of surge diverters (single phase or three phase)","number of units",null,null,0]
[null,{"$f":"IF(ISBLANK(B39),\"\",B39)","v":""},{"$f":"IF(ISBLANK(C73),\"\",C73)","v":""},null,null,0]
[null,"","",null,null,0]
[null,"","",null,null,{"$f":"D303-E303","v":0}]
[null,"","",null,null,{"$f":"D304-E304","v":0}]
[null,"","",null,null,{"$f":"D305-E305","v":0}]
[null,"","",null,null,0]
[null,"","",null,null,0]
[null,"To enter further activities - please copy row from above and \"insert copied cells\" into a row above this row. "]
[]
[null,"7.12.5 - RECONCILIATION OF VOLUME OF OUTCOMES REPORTED TO ESV AND AER"]
[null,"Activity","Units","Difference","Reasons for Difference"]
[null,"Planned non-preferred services replacements","number of services",{"$f":"D281-D53-D182","v":0}]
[null,"Planned replacement of non-preferred services due to height ","number of services",0]
[null,"Removal of public lighting switchwire ","number of spans removed",0]
[null,"Replacement of  existing SWER lines with 22kV overhead bare conductor ","kms of SWER",0]
[null,"Installation of GFN and associated equipment at zone substations ","number of zone substations",0]
[null,"Replacement of crossarms/insulator sets – pole top fire mitigation","number of crossarms/sets",0]
[null,"Replacement of crossarms – based on age and condition ","number of crossarms",0]
[null,"Replacement of poles – based on age and condition ","number of poles",0]
[null,"Stake poles – based on age and condition ","number of poles",0]
[null,"Replacement of undersized poles ","number of poles",0]
[null,"Stake undersized poles","number of poles",0]
[null,"Replacement of overhead conductor – mainly steel ","kms ",0]
[null,"Service line clearance – overhead services requiring relocation ","number of services",0]
[null,"Service line clearance – overhead services requiring undergrounding ","number of services",0]
[null,"Replacement of 22kV distribution feeders with ABC/underground cabling","number of feeders",0]
[null,"Replacement of SWER with covered carbon core conductor or equivalent","kms ",0]
[null,"Replacement of SWER with ABC","kms ",0]
[null,"Replacement of SWER with underground","kms ",0]
[null,"Replacement of surge diverters (neptune configuration)","number of units",0]
[null,"Replacement of surge diverters (single phase or three phase)","number of units",0]
[null,{"$f":"IF(ISBLANK(B39),\"\",B39)","v":""},{"$f":"IF(ISBLANK(C73),\"\",C73)","v":""},{"$f":"D301-D74-D202","v":0}]
[null,"","",0]
[null,"","",0]
[null,"","",0]
[null,"","",0]
[null,"","",0]
[null,"","",0]
[null,"To enter further activities - please copy row from above and \"insert copied cells\" into a row above this row. "]

{"sheet":"8.1 Income","index":19,"n_rows":40,"n_cols":12,"rows_kept":40,"cut":false,"hidden":false,"merged":[[6,6,6,10],[7,8,7,10],[6,11,8,11],[9,2,9,11],[6,5,8,5],[7,6,7,7],[6,2,8,2],[6,3,8,3],[6,4,8,4]]}
[null,{"$f":"IF(dms_DataQuality=\"backcast\",INDEX(dms_Worksheet_List,MATCH(dms_Model,dms_Model_List))&\" BACKCAST\",INDEX(dms_Worksheet_List,MATCH(dms_Model,dms_Model_List)))","v":"ANNUAL REPORTING STATEMENT"}]
[null,{"$f":"INDEX(dms_TradingNameFull_List,MATCH(dms_TradingName,dms_TradingName_List))","v":"Endeavour Energy"}]
[null,{"$f":"CONCATENATE(\"Annual Reporting RIN Response \",IF(SUM(dms_SingleYear_Model)>0,CONCATENATE(CRY),CONCATENATE(FRCP_y1,\" to \",dms_MultiYear_FinalYear_Result)))","v":"Annual Reporting RIN Response 2017-18"}]
[null,"8.1 - INCOME"]
[]
[null,"8.1.1 - INCOME STATEMENT"]
[null,null,"Audited Statutory Accounts","Adjustments","Distribution business","Standard Control Services","Alternative Control Services",null,null,null,null,"Negotiated Services"]
[null,null,null,null,null,null,"Public Lighting",null,"Other"]
[null,null,null,null,null,null,{"$f":"IF(dms_Jurisdiction=\"Vic\",\"Energy efficient\",\"\")","v":""},{"$f":"IF(dms_Jurisdiction=\"Vic\",\"Non-energy efficient\",\"\")","v":""},"Connection services","Metering services","Ancillary network services"]
[null,null,"$0's, nominal"]
[null,"8.1.1.1 - REVENUE"]
[null,"Distribution revenue",884817155.08901441,43543248.034203656,841273907.05481076,841273907.05481076,0,null,0,0,0]
[null,"Cross boundary revenue",0,0,0,0,0,null,0,0,0]
[null,"Contributions",177632277.37000003,10915712.590000039,166716564.77999997,147795218.36257714,17511495.997422852,null,0,1409850.42,0]
[null,"Interest income",2173201.3000000003,58034.770000000208,2115166.5299999998,2115166.5299999998,0,null,0,0,0]
[null,"Jurisdictional scheme amounts",89269244.629999995,3953302.429999996,85315942.200000003,85315942.200000003,0,null,0,0,0]
[null,"Profit from sale of fixed assets",1603390.95,1405263.27,198127.68,198127.68,0,null,0,0,0]
[null,"TUOS revenue",204818970.50098559,10534098.925796483,194284871.57518911,194284871.57518911,0,null,0,0,0]
[null,"Pass through revenue (F-factor)",0,0,0,0,0,null,0,0,0]
[null,"Other Revenue ",153961691.10999969,70875989.889999703,83085701.219999984,7635113.5200000005,22790358.329999998,null,0,17381720.700000003,35278508.669999994]
[null,"Total revenue",{"$f":"SUM(C12:C20)","v":1514275930.9499996},141285649.90999991,1372990281.04,1278618346.9225771,40301854.32742285,0,0,18791571.120000005,35278508.669999994,0]
[]
[null,"8.1.1.2 - EXPENDITURE"]
[null,"TUOS expenditure",201914351.71999997,9371024.9499999918,192543326.76999998,192543326.76999998,0,null,0,0,0]
[null,"Avoided TUOS expenditure",1445873.33,177650,1268223.33,1268223.33,0,null,0,0,0]
[null,"Cross boundary expenditure",0,0,0,0,0,null,0,0,0]
[null,"Depreciation ",263096478.23000002,12118398.149999993,250978080.08000001,228140461.78,15072828.078000002,null,0,7764790.222000001,0]
[null,"Finance charges",206536163.22000003,7388841.1100000087,199147322.11000001,199147322.11000001,0,null,0,0,0]
[null,"Impairment losses",0,0,0,0,0,null,0,0,0]
[null,"Jurisdictional scheme amounts",92312733.840000004,4127354.8199999933,88185379.020000011,88185379.020000011,0,null,0,0,0]
[null,"Loss from sale of fixed assets",9296774.3599999994,440386.84999999893,8856387.5099999998,1479253.09,0,null,0,7377134.4199999999,0]
[null,"Maintenance expenditure",211634165.15111887,1531902.4140208785,210102262.73709801,210102262.73709801,0,null,0,0,0]
[null,"Operating expenditure excluding maintenance expenditure",18349333.582194917,1786557.9221492298,16562775.660045689,16562775.660045689,0,null,0,0,0]
[null,"Other ",612624920.21668673,518859453.30885655,93765466.907830164,30657129.337236639,14335117.779750278,null,0,17572224.324244387,31200995.466598857]
[null,"Total expenditure",{"$f":"SUM(dms_080101_02_audited_Values)","v":1617210793.6500006},{"$f":"SUM(D24:D34)","v":555801569.52502668},{"$f":"SUM(dms_080101_02_dnsp_Values)","v":1061409224.1249738},{"$f":"SUM(dms_080101_02_SCS_Values)","v":968086133.83438039},{"$f":"SUM(G24:G34)","v":29407945.857750282},{"$f":"SUM(H24:H34)","v":0},{"$f":"SUM(dms_080101_02_connection_Values)","v":0},{"$f":"SUM(dms_080101_02_metering_Values)","v":32714148.966244388},{"$f":"SUM(dms_080101_02_ancillary_Values)","v":31200995.466598857},{"$f":"SUM(dms_080101_02_negotiated_Values)","v":0}]
[]
[null,"8.1.1.3 - PROFIT"]
[null,"Profit before tax (PBT)",{"$f":"C21-SUM(C24:C34)","v":-102934862.700001},-414515919.61502677,311581056.91502619,310532213.08819675,10893908.469672568,0,0,-13922577.846244384,4077513.2034011371,0]
[null,"Income tax expenses (/ benefit)",4542.2,-253.23901335577699,4288.9609866442197,4274.5234906716105,149.95631917135799,null,0,-191.64641717081099,56.127593972067402]
[null,"Profit after tax",{"$f":"C38-C39","v":-102939404.900001},-414515666.3760134,311576767.95403951,310527938.56470609,10893758.513353396,0,0,-13922386.199827213,4077457.0758071649,{"$f":"L38-L39","v":0}]

{"sheet":"8.2 Capex","index":20,"n_rows":248,"n_cols":10,"rows_kept":248,"cut":false,"hidden":false,"merged":[[140,2,140,3],[196,2,196,3],[6,1,6,4],[41,1,41,4],[10,1,10,4],[7,1,7,4],[8,1,8,4],[14,1,14,4],[16,2,16,9],[17,2,18,2],[17,3,18,3],[17,4,18,4],[17,5,18,5],[17,6,17,9],[19,2,19,3],[19,5,19,9],[43,2,43,5],[44,2,44,5],[55,2,55,5],[56,2,56,5],[50,2,50,5],[51,2,51,5],[49,2,49,5],[45,2,45,5],[46,2,46,5],[47,2,47,5],[81,1,81,2],[58,2,58,5],[63,3,64,3],[63,5,64,5],[65,5,65,9],[65,2,65,3],[57,2,57,5],[63,4,64,4],[48,2,48,5],[63,2,64,2],[52,2,52,5],[53,2,53,5],[54,2,54,5],[62,2,62,9],[63,6,63,9]]}
[null,{"$f":"IF(dms_DataQuality=\"backcast\",INDEX(dms_Worksheet_List,MATCH(dms_Model,dms_Model_List))&\" BACKCAST\",INDEX(dms_Worksheet_List,MATCH(dms_Model,dms_Model_List)))","v":"ANNUAL REPORTING STATEMENT"}]
[null,{"$f":"INDEX(dms_TradingNameFull_List,MATCH(dms_TradingName,dms_TradingName_List))","v":"Endeavour Energy"}]
[null,{"$f":"CONCATENATE(\"Annual Reporting RIN Response \",IF(SUM(dms_SingleYear_Model)>0,CONCATENATE(CRY),CONCATENATE(FRCP_y1,\" to \",dms_MultiYear_FinalYear_Result)))","v":"Annual Reporting RIN Response 2017-18"}]
[null,"8.2 - CAPEX"]
[]
[null,"Instructions"]
[null,"Reported expenditure must EXCLUDE capital contributions (except tables 8.2.1 and 8.2.5 which should include all capital contributions)."]
[null,"Forecast expenditure is to be taken from Australian Distribution Co.'s distribution determination."]
[null,"If allocating based on assumptions then provide method in Basis of Preparation. All adjustments must be explained in Basis of Preparation with supporting documentation attached. "]
[]
[null,"For tables 8.2.1 and 8.2.3:\nReported expenditure must INCLUDE any profit margins or management fees paid directly or indirectly to related party contractors (not including actual incurred expenses of the related party contractor) for the regulatory reporting period.\n\n'Related Party Margin Expenditure' must COMPRISE ONLY profit margins or management fees paid directly or indirectly to related party contractors (not including actual incurred expenses of the related party contractor) for the regulatory reporting period."]
[]
[null,"8.2.1 - CAPEX BY PURPOSE - STANDARD CONTROL SERVICES"]
[]
[null,"Each line item in this table must INCLUDE the capital contributions. Total capital contributions should also be identified in the last item in the table. "]
[]
[null,null,"EXPENDITURE"]
[null,null,"CPI adjusted Forecast","Actual","Difference","Related Party Margin","Voltage level"]
[null,null,null,null,null,null,"Subtransmission","HV","LV","Other "]
[null,"Description","$0's, nominal",null," (%)","$0's, nominal"]
[null,"Augmentation",58695731.093111053,{"$f":"SUM(G21:J21)","v":35669539},{"$f":"IF(C21=0,1,(D21-C21)/C21*1)","v":-0.39229756004885286},null,30319228,4715573,634738,0]
[null,"Connections",16830319.771278493,{"$f":"SUM(G22:J22)","v":21420016},{"$f":"IF(C22=0,1,(D22-C22)/C22*1)","v":0.27270404193709841},null,0,18515351,2904665,0]
[null,"Replacement",110052805.25764574,143673734.8599999,0.30549816084782078,null,48014028.587520853,42581298.126880899,51176809.634445392,1901598.511152734]
[null,"Reliability improvement ",5519033.4314906746,3461471,-0.37281209781237601,null,0,3461471,0,0]
[null,"Other System Assets",89404136.716287017,177481548.36257714,0.98516036149191744,null,31247051.778541595,53246182.834084988,69205996.921294808,23782316.828655742]
[null,"Non-Network",31256765.388901845,{"$f":"SUM(G26:J26)","v":63830171.160000205},1.042123372838317,null,null,null,null,63830171.160000205]
[null,"Capitalised overheads",76591453.501249,53057014,-0.30727239692435421,null,null,null,null,53057014]
[null,null,null,0,1]
[null,null,null,0,1]
[null,null,null,{"$f":"SUM(G30:J30)","v":0},1]
[null,null,null,0,1]
[null,null,null,0,1]
[null,null,null,0,1]
[null,null,null,0,1]
[null,null,null,0,1]
[null,"Capital contributions included in the above",85600921.599140972,147795218.36257714,0.72656106501615403,null,31247051.778541595,47271402.834084988,68754849.921294808,521913.828655741]
[null,"Total",{"$f":"SUM(C21:C35)","v":388350245.15996379},498593494.38257724,{"$f":"IF(C37=0,1,(D37-C37)/C37*1)","v":0.28387583269634242},null,{"$f":"SUM(G21:G35)","v":109580308.36606245},{"$f":"SUM(H21:H35)","v":122519875.96096589},123922209.55574021,142571100.49980867]
[]
[]
[null,"8.2.2 - CAPEX BY PURPOSE - MATERIAL DIFFERENCE EXPLANATION"]
[]
[null,"Where the difference between forecast and actual expenditure shown in table 8.2.1 is a Material Difference please explain the main factors driving the difference."]
[]
[null,"Description","Reason for material difference"]
[null,"Augmentation","Below the forecast due to lower than expected major projects and HV developments."]
[null,"Connections","Above the forecast due to higher than expected industrial & commercial and URD."]
[null,"Replacement","Above the forecast due to higher than expected distribution refurbishment and transmission mains/subs expenditure."]
[null,"Reliability improvement ","Below the forecast due to lower than expected HV reliability developments"]
[null,"Other System Assets","Above the forecast due to capital contributions and direct capital overheads being reported in the actuals within other system assets whereas the forecast for direct capital overheads was within capitalised overheads."]
[null,"Non-Network","Investement in information technology with development of an ADMS, SAP enterprise system and security improvements."]
[null,"Capitalised overheads","Below the forecast due to direct capital overheads being reported in the actuals within other system assets.  The remainder of the variance is due to lower indirect capitalised overheads as a result of a lower eligible operating overhead pool."]
[]
[]
[]
[]
[]
[]
[]
[]
[]
[]
[null,"8.2.3 - CAPEX OTHER"]
[null,null,"EXPENDITURE"]
[null,null,"CPI adjusted Forecast","Actual","Difference","Related Party Margin","Voltage level"]
[null,null,null,null,null,null,"Subtransmission","HV","LV","Other "]
[null,null,"$0's, nominal",null," (%)","$0's, nominal"]
[null,"Public lighting"]
[null,{"$f":"IF(dms_Jurisdiction=\"Vic\",\"Energy Efficient\", \"Total\")","v":"Total"},0,{"$f":"SUM(G68:J68)","v":8218966.4502630485},{"$f":"IF(C68=0,1,((D68-C68)/C68)*1)","v":1},0,0,0,0,8218966.4502630485]
[null,{"$f":"IF(dms_Jurisdiction=\"Vic\",\"Non-energy efficient\", \"\")","v":""},null,{"$f":"SUM(G69:J69)","v":0},{"$f":"IF(C69=0,1,((D69-C69)/C69)*1)","v":1}]
[null,"Alternative Control Services"]
[null,"Connection services",0,{"$f":"SUM(G71:J71)","v":0},{"$f":"IF(C71=0,1,((D71-C71)/C71)*1)","v":1},0,0,0,0,0]
[null,"Metering services",0,1309989.7559178271,{"$f":"IF(C72=0,1,((D72-C72)/C72)*1)","v":1},0,0,0,0,1309989.7559178271]
[null,"Ancillary network services",0,0,{"$f":"IF(C73=0,1,((D73-C73)/C73)*1)","v":1},0,0,0,0,0]
[null,"Negotiated Services"]
[null,"Negotiated services",0,{"$f":"SUM(G75:J75)","v":0},{"$f":"IF(C75=0,1,((D75-C75)/C75)*1)","v":1},0,0,0,0,0]
[null,"Total",{"$f":"SUM(C68:C69,C71:C73,C75)","v":0},{"$f":"SUM(D68:D69,D71:D73,D75)","v":9528956.2061808761},{"$f":"IF(C76=0,1,((D76-C76)/C76)*1)","v":1},null,{"$f":"SUM(G68:G69,G71:G73,G75)","v":0},{"$f":"SUM(H68:H69,H71:H73,H75)","v":0},{"$f":"SUM(I68:I69,I71:I73,I75)","v":0},{"$f":"SUM(J68:J69,J71:J73,J75)","v":9528956.2061808761}]
[]
[]
[]
[null,"8.2.4 - CAPEX BY ASSET CLASS"]
[]
[null,"Australian Distribution Co. to enter in Table 8.2.4 each Asset Class specified in its current determination as listed in the AER's final decision in its Roll Forward Model and Post-tax Revenue Model and enter information against that Asset Class."]
[]
[null,null,"CPI adjusted Forecast","Actual ","Difference","Movements in provisions \nallocated to \nas-incurred capex"]
[null,"Asset class","$0's, nominal",null," (%)","$0's, nominal"]
[null,"Sub-transmission lines and cables",31443176.082949605,21546750.883967757,{"$f":"IF(C86=0,1,((D86-C86)/C86)*1)","v":-0.31473999868442964},-502992.82522924524]
[null,"Distribution lines and cables",103129409.00867833,54723910.658213913,{"$f":"IF(C87=0,1,((D87-C87)/C87)*1)","v":-0.46936658336121267},-1277488.8695654264]
[null,"Substations",108813745.86735515,111235620.83832841,2.2257068274494831E-2,-2596712.585247878]
[null,"Transformers",4258772.8604511516,16811274.399280816,2.947445649284973,-392446.65942140447]
[null,"Low Voltage lines and cables",16887042.631271284,72612275.830523893,3.2998811228237845,-1695079.409559442]
[null,"Customer metering and Load control",485782.02733995131,681086.86901918484,0.40204213142401579,-15899.464857571855]
[null,"Communication",4508096.964610788,8106209.080355214,0.79814434871080309,-189233.40364326889]
[null,"Land",204524.92601654714,0,-1,0]
[null,"Easements",0,91990.318060987251,1,-2147.4453491575478]
[null,"Equity raising costs",0,0,1,0]
[null,"Emergency Spares (Major Plant, Excludes Inventory)",1762007.8032483049,1158986.4860688008,-0.34223532726008332,-27055.674898252269]
[null,"Information & Communication Technology",20975051.152908187,48526203.630000204,1.3135201566968313,-1132808.022561996]
[null,"Furniture, fittings, plant and equipment",3461950.588633575,3504942.1800000048,1.241831455006367E-2,-81820.260459553305]
[null,"Motor Vehicles",3307704.1801830139,5420970.5099999951,0.63889217859260172,-126548.51244129695]
[null,"Buildings",3512059.4671770791,6361253.3600000013,0.81126015076078584,-148498.71411128613]
[null,"Land (non-system)",0,16801.48,1,-392.21801647694332]
[null,"Other non system assets",0,0,1,0]
[null,null,null,null,1]
[null,null,null,null,1]
[null,null,null,null,1]
[null,null,null,null,1]
[null,null,null,null,1]
[null,null,null,null,1]
[null,null,null,null,1]
[null,null,null,null,1]
[null,null,null,null,1]
[null,null,null,null,1]
[null,null,null,null,1]
[null,null,null,null,1]
[null,null,null,null,1]
[null,null,null,null,{"$f":"IF(C116=0,1,((D116-C116)/C116)*1)","v":1}]
[null,null,null,null,1]
[null,null,null,null,1]
[null,null,null,null,1]
[null,null,null,null,1]
[null,null,null,null,1]
[null,null,null,null,1]
[null,null,null,null,1]
[null,null,null,null,1]
[null,null,null,null,1]
[null,null,null,null,1]
[null,null,null,null,1]
[null,null,null,null,1]
[null,null,null,null,1]
[null,null,null,null,1]
[null,null,null,null,1]
[null,null,null,null,1]
[null,null,null,null,1]
[null,null,null,null,1]
[null,null,null,null,1]
[null,"Total",{"$f":"SUM(C86:C135)","v":302749323.56082302},{"$f":"SUM(D86:D135)","v":350798276.52381927},0.15870870460704134,{"$f":"SUM(F86:F135)","v":-8189124.065362257}]
[]
[]
[null,"8.2.5 - CAPITAL CONTRIBUTIONS BY ASSET CLASS"]
[null,null,"CPI Adjusted Forecast","Actual","Difference"]
[null,"Asset class","$0's, nominal",null," (%)"]
[null,{"$f":"IF(ISBLANK(B86),\"\",B86)","v":"Sub-transmission lines and cables"},null,14022598.247405909,{"$f":"IF(C142=0,1,((D142-C142)/C142)*1)","v":1}]
[null,"Distribution lines and cables",null,46038300.363173813,{"$f":"IF(C143=0,1,((D143-C143)/C143)*1)","v":1}]
[null,"Substations",null,17224453.531135686,1]
[null,"Transformers",null,1233102.4709111764,1]
[null,"Low Voltage lines and cables",null,68754849.921294808,1]
[null,"Customer metering and Load control",null,0,1]
[null,"Communication",null,0,1]
[null,"Land",null,529746.66065574065,1]
[null,"Easements",null,0,1]
[null,"Equity raising costs",null,0,1]
[null,"Emergency Spares (Major Plant, Excludes Inventory)",null,0,1]
[null,"Information & Communication Technology",null,0,1]
[null,"Furniture, fittings, plant and equipment",null,0,1]
[null,"Motor Vehicles",null,0,1]
[null,"Buildings",null,0,1]
[null,"Land (non-system)",null,0,1]
[null,"Other non system assets",null,-7832.8319999999994,1]
[null,"",null,null,1]
[null,"",null,null,1]
[null,"",null,null,1]
[null,"",null,null,1]
[null,"",null,null,1]
[null,"",null,null,1]
[null,"",null,null,1]
[null,"",null,null,1]
[null,"",null,null,1]
[null,"",null,null,1]
[null,"",null,null,1]
[null,"",null,null,1]
[null,"",null,null,{"$f":"IF(C171=0,1,((D171-C171)/C171)*1)","v":1}]
[null,"",null,null,1]
[null,"",null,null,1]
[null,{"$f":"IF(ISBLANK(B118),\"\",B118)","v":""},null,null,1]
[null,"",null,null,1]
[null,"",null,null,1]
[null,"",null,null,1]
[null,"",null,null,1]
[null,"",null,null,1]
[null,"",null,null,1]
[null,"",null,null,{"$f":"IF(C181=0,1,((D181-C181)/C181)*1)","v":1}]
[null,"",null,null,1]
[null,"",null,null,1]
[null,"",null,null,1]
[null,"",null,null,1]
[null,"",null,null,1]
[null,"",null,null,1]
[null,"",null,null,1]
[null,"",null,null,1]
[null,"",null,null,1]
[null,"",null,null,1]
[null,"Total",{"$f":"SUM(C142:C191)","v":0},{"$f":"SUM(D142:D191)","v":147795218.36257714},1]
[]
[]
[null,"8.2.6 - DISPOSALS BY ASSET CLASS"]
[null,null,"CPI Adjusted Forecast","Actual","Difference"]
[null,"Asset class","$0's, nominal",null," (%)"]
[null,{"$f":"IF(ISBLANK(B86),\"\",B86)","v":"Sub-transmission lines and cables"},0,0,{"$f":"IF(C198=0,1,((D198-C198)/C198)*1)","v":1}]
[null,"Distribution lines and cables",0,0,{"$f":"IF(C199=0,1,((D199-C199)/C199)*1)","v":1}]
[null,"Substations",0,0,1]
[null,"Transformers",0,474599.99,1]
[null,"Low Voltage lines and cables",0,0,1]
[null,"Customer metering and Load control",0,0,1]
[null,"Communication",0,0,1]
[null,"Land",0,3072377.56,1]
[null,"Easements",0,0,1]
[null,"Equity raising costs",0,0,1]
[null,"Emergency Spares (Major Plant, Excludes Inventory)",0,0,1]
[null,"Information & Communication Technology",0,0,1]
[null,"Furniture, fittings, plant and equipment",0,0,1]
[null,"Motor Vehicles",0,171454.35304740406,1]
[null,"Buildings",0,0,1]
[null,"Land (non-system)",0,0,1]
[null,"Other non system assets",0,154.71945799457993,1]
[null,"",null,null,1]
[null,"",null,null,1]
[null,"",null,null,1]
[null,"",null,null,1]
[null,"",null,null,1]
[null,"",null,null,1]
[null,"",null,null,1]
[null,"",null,null,1]
[null,"",null,null,1]
[null,"",null,null,1]
[null,"",null,null,1]
[null,"",null,null,1]
[null,"",null,null,1]
[null,"",null,null,{"$f":"IF(C228=0,1,((D228-C228)/C228)*1)","v":1}]
[null,"",null,null,1]
[null,{"$f":"IF(ISBLANK(B118),\"\",B118)","v":""},null,null,1]
[null,"",null,null,1]
[null,"",null,null,1]
[null,"",null,null,1]
[null,"",null,null,1]
[null,"",null,null,1]
[null,"",null,null,1]
[null,"",null,null,1]
[null,"",null,null,1]
[null,"",null,null,1]
[null,"",null,null,1]
[null,"",null,null,1]
[null,"",null,null,1]
[null,"",null,null,1]
[null,"",null,null,1]
[null,"",null,null,1]
[null,"",null,null,1]
[null,"",null,null,1]
[null,"Total",{"$f":"SUM(C198:C247)","v":0},{"$f":"SUM(D198:D247)","v":3718586.6225053985},1]

{"sheet":"8.4 Opex","index":21,"n_rows":139,"n_cols":14,"rows_kept":139,"cut":false,"hidden":false,"merged":[[153,2,153,7],[154,2,154,7],[143,2,143,7],[144,2,144,7],[145,2,145,7],[146,2,146,7],[148,2,148,7],[149,2,149,7],[150,2,150,7],[151,2,151,7],[152,2,152,7],[6,1,6,4],[13,1,13,5],[15,2,17,2],[15,3,17,3],[15,4,17,4],[11,1,11,5],[7,1,7,4],[12,1,12,5],[16,5,17,5],[15,5,15,7],[16,7,17,7],[74,1,74,4],[18,2,18,6],[15,13,17,13],[76,13,78,13],[18,8,18,13],[16,8,16,9],[77,8,77,9],[77,10,77,12],[16,10,16,12],[15,8,15,12],[76,8,76,12],[76,5,76,7],[76,2,78,2],[76,3,78,3],[76,4,78,4],[16,6,17,6],[79,8,79,13],[77,6,78,6],[77,7,78,7],[156,2,156,7],[157,2,157,7],[79,2,79,4],[77,5,78,5],[137,2,137,7],[138,2,138,7],[155,2,155,7],[135,1,135,4],[139,2,139,7],[140,2,140,7],[141,2,141,7],[142,2,142,7],[147,2,147,7]]}
[null,{"$f":"IF(dms_DataQuality=\"backcast\",INDEX(dms_Worksheet_List,MATCH(dms_Model,dms_Model_List))&\" BACKCAST\",INDEX(dms_Worksheet_List,MATCH(dms_Model,dms_Model_List)))","v":"ANNUAL REPORTING STATEMENT"}]
[null,{"$f":"INDEX(dms_TradingNameFull_List,MATCH(dms_TradingName,dms_TradingName_List))","v":"Endeavour Energy"}]
[null,{"$f":"CONCATENATE(\"Annual Reporting RIN Response \",IF(SUM(dms_SingleYear_Model)>0,CONCATENATE(CRY),CONCATENATE(FRCP_y1,\" to \",dms_MultiYear_FinalYear_Result)))","v":"Annual Reporting RIN Response 2017-18"}]
[null,"8.4 OPEX"]
[]
[null,"Instructions"]
[null,"Forecast expenditure is to be taken from Australian Distribution Co.'s distribution determination."]
[null,"If allocating based on assumptions then provide method in Basis of Preparation.  \n\nAll adjustments must be explained in Basis of Preparation with supporting documentation attached. "]
[]
[null,"8.4.1 - OPERATING & MAINTENANCE EXPENDITURE - BY PURPOSE"]
[]
[null,"Australian Distribution Co. is to list the operating expenditure categories identified in Australian Distribution Co.'s regulatory proposal at table 3.2.1.1 current opex categories and cost allocations."]
[null,"Australian Distribution Co. must specify any expenditure category where the expense is more than 5 per cent of the total standard control services operating expenditure."]
[null,"Reported operating expenditure must INCLUDE any profit margins or management fees paid directly or indirectly to related party contractors (not including actual incurred expenditure of the related party contractor) for the regulatory reporting period.  "]
[]
[null,null,"Audited Statutory Accounts","Adjustments","Distribution business","Standard Control Services",null,null,"Alternative Control Services",null,null,null,null,"Negotiated Services"]
[null,null,null,null,null,"CPI Adjusted Forecast","Actual","Difference","Public Lighting",null,"Other"]
[null,null,null,null,null,null,null,null,{"$f":"IF(dms_Jurisdiction=\"Vic\",\"Energy efficient\",\"\")","v":""},{"$f":"IF(dms_Jurisdiction=\"Vic\",\"Non-energy efficient\",\"\")","v":""},"Connection services","Metering services","Ancillary network services"]
[null,"Opex category","$0's, nominal",null,null,null,null,"%","$0's, nominal"]
[null,"Vegetation management",50604841.408892862,8845096.508892864,41759744.899999999,42736248.601677336,41759744.899999999,{"$f":"IF(F20=0,1,((G20-F20)/F20)*1)","v":-2.2849541867346095E-2},0,null,0,0,0]
[null,"Maintenance",59640205.402788915,10424365.691326112,49215839.711462803,50366695.632026672,49215839.711462803,-2.2849541867346057E-2,0,null,0,0,0]
[null,"Emergency response",19147941.300490666,3346821.8461740464,15801119.45431662,16170610.495862372,15801119.45431662,-2.2849541867346029E-2,0,null,0,0,0]
[null,"Non-network",75423451.668532893,13183080.71853289,62240370.950000003,63695790.58371634,62240370.950000003,-2.2849541867346123E-2,0,null,0,0,0]
[null,"network overheads",81115744.149968326,14178022.604593098,66937721.545375228,58484330.036697924,57147989.888940707,-2.2849541867346116E-2,1916492.0865653604,null,0,1012910.1474748774,6860329.4223942822]
[null,"corporate overheads",140766262.87724525,24604190.936691999,116162071.94055325,95582214.030933693,93398204.229660243,-2.2849541867346047E-2,6305061.1196671808,null,0,6146997.5423363037,10311809.048889522]
[null,"Metering",12617740.679365838,2205424.0449326206,10412316.634433217,0,0,1,0,null,0,10412316.634433217,0]
[null,"Public Lighting",7408473.5533403726,1294908.9798226422,6113564.5735177305,0,0,1,6113564.5735177305,null,0,0,0]
[null,"Fee and quoted",17000297.417907704,2971440.4225926753,14028856.995315028,0,0,1,0,null,0,0,14028856.995315028]
[null,"Balancing Item",-75423451.668532893,-13183080.71853289,-62240370.950000003,-63695790.58371634,-62240370.950000003,-2.2849541867346123E-2,0,null,0,0,0]
[null,null,null,null,null,null,null,1]
[null,null,null,null,null,null,null,1]
[null,null,null,null,null,null,null,1]
[null,null,null,null,null,null,null,1]
[null,null,null,null,null,null,null,1]
[null,null,null,null,null,null,null,{"$f":"IF(F35=0,1,((G35-F35)/F35)*1)","v":1}]
[null,null,null,null,null,null,null,1]
[null,null,null,null,null,null,null,1]
[null,null,null,null,null,null,null,1]
[null,null,null,null,null,null,null,1]
[null,null,null,null,null,null,null,1]
[null,null,null,null,null,null,null,{"$f":"IF(F41=0,1,((G41-F41)/F41)*1)","v":1}]
[null,null,null,null,null,null,null,1]
[null,null,null,null,null,null,null,1]
[null,null,null,null,null,null,null,1]
[null,null,null,null,null,null,null,1]
[null,null,null,null,null,null,null,1]
[null,null,null,null,null,null,null,1]
[null,null,null,null,null,null,null,1]
[null,null,null,null,null,null,null,1]
[null,null,null,null,null,null,null,1]
[null,null,null,null,null,null,null,1]
[null,null,null,null,null,null,null,1]
[null,null,null,null,null,null,null,1]
[null,null,null,null,null,null,null,1]
[null,null,null,null,null,null,null,1]
[null,null,null,null,null,null,null,1]
[null,null,null,null,null,null,null,1]
[null,null,null,null,null,null,null,1]
[null,null,null,null,null,null,null,1]
[null,null,null,null,null,null,null,1]
[null,null,null,null,null,null,null,1]
[null,null,null,null,null,null,null,1]
[null,null,null,null,null,null,null,1]
[null,null,null,null,null,null,null,1]
[null,null,null,null,null,null,null,1]
[null,null,null,null,null,null,null,1]
[null,null,null,null,null,null,null,1]
[null,null,null,null,null,null,null,1]
[null,null,null,null,null,null,null,1]
[null,"Total",{"$f":"SUM(C20:C69)","v":388301506.7899999},67870271.035026044,320431235.75497389,263340098.797198,257322898.18438035,-2.284954186734614E-2,{"$f":"SUM(I20:I69)","v":14335117.779750273},0,0,17572224.324244399,31200995.466598831,0]
[]
[]
[null,"8.4.2 - OPERATING & MAINTENANCE EXPENDITURE - BY PURPOSE - MARGINS ONLY"]
[]
[null,"\"Related party margin expenditure' must COMPRISE ONLY profit margins or management fees paid directly or indirectly to related party contractors (for expenditure that is not an actual incurred expenditure of the related party contractor) for the regulatory reporting period."]
[]
[null,null,"Audited Statutory Accounts","Adjustments","Distribution business","Standard Control Services",null,null,"Alternative Control Services",null,null,null,null,"Negotiated Services"]
[null,null,null,null,null,"CPI Adjusted Forecast","Actual","Difference","Public Lighting",null,"Other"]
[null,null,null,null,null,null,null,null,{"$f":"IF(dms_Jurisdiction=\"Vic\",\"Energy efficient\",\"\")","v":""},{"$f":"IF(dms_Jurisdiction=\"Vic\",\"Non-energy efficient\",\"\")","v":""},"Connection services","Metering services","Ancillary network services"]
[null,"Opex category","$0's, nominal",null,null,null,"$0's, nominal","per cent","$0's, nominal"]
[null,{"$f":"IF(ISBLANK(B20),\"\",B20)","v":"Vegetation management"},0,0,0,0,0,{"$f":"IF(F81=0,1,((G81-F81)/F81)*1)","v":1},0,0,0,0,0,0]
[null,"Maintenance",0,0,0,0,0,1,0,0,0,0,0,0]
[null,"Emergency response",0,0,0,0,0,1,0,0,0,0,0,0]
[null,"Non-network",0,0,0,0,0,1,0,0,0,0,0,0]
[null,"network overheads",0,0,0,0,0,1,0,0,0,0,0,0]
[null,"corporate overheads",0,0,0,0,0,1,0,0,0,0,0,0]
[null,"Metering",0,0,0,0,0,1,0,0,0,0,0,0]
[null,"Public Lighting",0,0,0,0,0,{"$f":"IF(F88=0,1,((G88-F88)/F88)*1)","v":1},0,0,0,0,0,0]
[null,"Fee and quoted",0,0,0,0,0,1,0,0,0,0,0,0]
[null,"Balancing Item",0,0,0,0,0,1,0,0,0,0,0,0]
[null,"",null,null,null,null,null,1]
[null,"",null,null,null,null,null,1]
[null,"",null,null,null,null,null,1]
[null,"",null,null,null,null,null,1]
[null,"",null,null,null,null,null,1]
[null,"",null,null,null,null,null,1]
[null,"",null,null,null,null,null,{"$f":"IF(F97=0,1,((G97-F97)/F97)*1)","v":1}]
[null,"",null,null,null,null,null,1]
[null,"",null,null,null,null,null,1]
[null,"",null,null,null,null,null,1]
[null,"",null,null,null,null,null,1]
[null,"",null,null,null,null,null,1]
[null,"",null,null,null,null,null,{"$f":"IF(F103=0,1,((G103-F103)/F103)*1)","v":1}]
[null,"",null,null,null,null,null,1]
[null,"",null,null,null,null,null,1]
[null,"",null,null,null,null,null,1]
[null,"",null,null,null,null,null,1]
[null,"",null,null,null,null,null,1]
[null,"",null,null,null,null,null,1]
[null,"",null,null,null,null,null,1]
[null,"",null,null,null,null,null,1]
[null,"",null,null,null,null,null,1]
[null,"",null,null,null,null,null,1]
[null,"",null,null,null,null,null,1]
[null,"",null,null,null,null,null,1]
[null,"",null,null,null,null,null,1]
[null,"",null,null,null,null,null,1]
[null,"",null,null,null,null,null,1]
[null,"",null,null,null,null,null,1]
[null,"",null,null,null,null,null,1]
[null,"",null,null,null,null,null,1]
[null,"",null,null,null,null,null,1]
[null,"",null,null,null,null,null,1]
[null,"",null,null,null,null,null,1]
[null,"",null,null,null,null,null,1]
[null,"",null,null,null,null,null,1]
[null,"",null,null,null,null,null,1]
[null,"",null,null,null,null,null,1]
[null,"",null,null,null,null,null,1]
[null,"",null,null,null,null,null,1]
[null,"Total",{"$f":"SUM(C81:C130)","v":0},{"$f":"SUM(D81:D130)","v":0},{"$f":"SUM(E81:E130)","v":0},{"$f":"SUM(F81:F130)","v":0},{"$f":"SUM(G81:G130)","v":0},1,{"$f":"SUM(I81:I130)","v":0},0,0,0,0,0]
[]
[]
[null,"8.4.3 - OPERATING & MAINTENANCE EXPENDITURE - EXPLANATION OF MATERIAL DIFFERENCE"]
[]
[null,"Where the difference between forecast and actual expenditure shown in table 8.4.1, column I is a Material Difference please explain the main factors driving the difference."]
[]
[null,"Category","Explanation"]
[null,"Variances 2% lower than forecast are not material"]

{"sheet":"9.5 TUoS","index":22,"n_rows":67,"n_cols":6,"rows_kept":67,"cut":false,"hidden":false,"merged":[[64,1,64,4],[58,1,58,4],[24,1,24,4],[25,1,25,4],[66,1,66,4],[60,1,60,4],[55,1,55,4],[65,1,65,4],[47,1,47,4],[51,1,51,4],[52,1,52,4],[53,1,53,4],[54,1,54,4],[48,1,48,4],[49,1,49,4],[50,1,50,4],[57,1,57,4],[61,1,61,4],[59,1,59,4],[62,1,62,4],[63,1,63,4],[5,1,5,3],[26,1,26,3],[30,2,30,5],[42,1,42,4],[31,2,31,5],[9,1,9,4],[12,1,12,4],[13,1,13,4],[14,1,14,4],[20,1,20,4],[23,1,23,4],[15,1,15,3],[10,1,10,4],[11,1,11,4],[21,1,21,4],[22,1,22,4]]}
[null,{"$f":"IF(dms_DataQuality=\"backcast\",INDEX(dms_Worksheet_List,MATCH(dms_Model,dms_Model_List))&\" BACKCAST\",INDEX(dms_Worksheet_List,MATCH(dms_Model,dms_Model_List)))","v":"ANNUAL REPORTING STATEMENT"}]
[null,{"$f":"INDEX(dms_TradingNameFull_List,MATCH(dms_TradingName,dms_TradingName_List))","v":"Endeavour Energy"}]
[null,{"$f":"CONCATENATE(\"Annual Reporting RIN Response \",IF(SUM(dms_SingleYear_Model)>0,CONCATENATE(CRY),CONCATENATE(FRCP_y1,\" to \",dms_MultiYear_FinalYear_Result)))","v":"Annual Reporting RIN Response 2017-18"}]
[null,"9.5 - TUoS AUDIT (t-2)"]
[]
[null,"This template collects information for annual pricing proposals from Victorian businesses only.\n"]
[]
[null,"9.5.1 - TUOS CHARGES (AEMO)"]
[null,null,null,null,null,{"$f":"CRY","v":"2017-18"}]
[]
[]
[]
[]
[]
[]
[null,null,null,null,"Total",{"$f":"SUM(F10:F15)","v":0}]
[]
[]
[null,"9.5.2 - TRANSMISSION CONNECTION FEES"]
[null,null,null,null,null,{"$f":"CRY","v":"2017-18"}]
[]
[]
[]
[]
[]
[]
[null,null,null,null,"Total",{"$f":"SUM(F21:F26)","v":0}]
[]
[]
[null,"9.5.3 - CROSS BOUNDARY NETWORK CHARGES"]
[null,null,"Amount (payable)/receivable"]
[null,null,"$0's, nominal"]
[null,null,"HV crossings","Subtransmission crossings","TUoS Adjustment","Total"]
[null,"Distribution Business",null,null,null,{"$f":"CRY","v":"2017-18"}]
[null,null,null,null,null,{"$f":"IF((SUM(C35:E35)=0),\"\",(SUM(C35:E35)))","v":""}]
[null,null,null,null,null,{"$f":"IF((SUM(C36:E36)=0),\"\",(SUM(C36:E36)))","v":""}]
[null,null,null,null,null,""]
[null,null,null,null,null,""]
[null,null,null,null,null,""]
[null,null,null,null,null,""]
[null,null,null,null,null,""]
[null,null,null,null,null,""]
[null,"Total",null,null,null,""]
[]
[]
[null,"9.5.4 - PAYMENTS TO EMBEDDED GENERATORS"]
[null,"9.5.4.1 - AVOIDED TRANSMISSION COSTS",null,null,null,"2016-17"]
[]
[]
[]
[]
[]
[]
[]
[]
[null,"Total",null,null,null,{"$f":"SUM(F48:F55)","v":0}]
[null,"9.5.4.2 - AVOIDED TUoS USAGE CHARGES",null,null,null,"2016-17"]
[]
[]
[]
[]
[]
[]
[]
[]
[null,"Total",null,null,null,{"$f":"SUM(F58:F65)","v":0}]
[null,"Total payments to embedded generators",null,null,null,{"$f":"F66+F56","v":0}]

{"sheet":"NSP Amendments","index":23,"n_rows":5,"n_cols":5,"rows_kept":5,"cut":false,"hidden":false,"merged":[]}
[]
[null,null,null,"Amended Table","Comments"]
[null,null,null,"3.6.7.3 - Call Centre Performance","Endeavour Eenrgy has detected a formula error in the Annual Reporting RIN template under table 3.6.7.3. which has resulted in the populated figure for ‘total calls’ being picked up as the same as the ‘calls answered within 30s’ figure.  \n\n"]
[null,null,null,null,"The AER has confirmed that they consider the cells in question to be outside the scope of the audit, as they are based on a formula, rather than an input."]
[null,null,null,null,"The correct amounts should be: cell D63 - 189,339 and cell D64 - 186,189"]

{"sheet":"Sheet1","index":24,"n_rows":0,"n_cols":0,"rows_kept":0,"cut":false,"hidden":false,"merged":[]}